{"text_format":"1","workbook":"xlsx","n_sheets":4,"sheets":["Hoja1","Hoja2","Hoja3","Hoja4"],"not_rendered":{"charts":0,"images":4,"macros":1,"external_links":0,"defined_names":2,"comments":0,"pivot_tables":0},"unopened":[],"bounds":{"document_bytes":16777216,"sheet_cells":100000,"rows_first":2000,"rows_last":500,"rows_between":2000,"halvings":0,"cell_chars":16384,"cell_head_chars":4096},"cells_cut":0,"cells_raw":0,"read":"whole","date_system":"1900"}

{"sheet":"Hoja1","index":0,"n_rows":981,"n_cols":11,"rows_kept":981,"cut":false,"hidden":false,"merged":[]}
[1,"El largo desarrollo del conflicto obligó al bando republicano a reorganizar sus fuerzas militares para hacerlas más efectivas. ","¿ Con qué nombre se conoció a la nueva formación ?","Quinto regimiento","Ejército rojo","Ejército Popular de la República","Milicia cofederal","Ejército Popular de la República",3,"Guerra Civil España"]
[2,"¿ En cuál de estos lugares no consiguieron imponerse los sublevados al comienzo del pronunciamiento militar en julio de 1936 ?",null,"Valencia","Castilla y León","galicia","Andalucia","Valencia",1,"Guerra Civil España"]
[3,"En las primeras semanas de conflicto, el bando republicano consigue bloquear al sublevado en un estratégico lugar, si bien la ayuda militar de Hitler y Mussolini permitió al bando nacional romper el bloqueo. ","¿ De qué lugar se trataba ?","Islas Baleares","Los Pirineos","Estrecho de Gibraltar","Desfiladero de Despeñaperros","Estrecho de Gibraltar",3,"Guerra Civil España"]
[4,"Tras la guerra se produjo un proceso de depuración a los funcionarios públicos. ","¿ Dónde se produjo la mayor purga en contra de los sospechosos de haber apoyado a la República ?","En la educación","En la hacienda","En los ayuntamientos","En la sanidad","En la educación",1,"Guerra Civil España"]
[5,"Tras el inicio de la contienda, el General Sanjurjo iba a ponerse al frente de los sublevados, pero finalmente no fue así. ","¿ Por qué ?","Fue rechazado por su profundo anticlericalismo","Se paso al bando republicano","Fue hecho prisionero y ejecutado","Falleció en un accidente de avión","Falleció en un accidente de avión",4,"Guerra Civil España"]
[6,"Durante el desarrollo de la Guerra tomó auge la figura de los alféreces provisionales. ","¿ Quiénes eran ?","Heridos de guerra que tras el campo de batalla hicieron labores administrativas","Ciudadanos civiles en la reserva","Milicianos republicanos que eran canjeados por prisioneros de guerra","Mandos intemedios de rápida preparación en el bando nacional","Mandos intemedios de rápida preparación en el bando nacional",4,"Guerra Civil España"]
[7,"Aproximadamente, ","¿ cuántas personas entre civiles y militares fallecieron durante la Guerra Civil en España ?",2000000,150000,1000000,500000,500000,4,"Guerra Civil España"]
[8,"A partir de 1952, el régimen pone en prácticas varios planes de desarrollo integral destinados a provincias atrasadas. ","¿ Cuál fue la primera provincia española en recibir esta ayuda ?","Jaén","Almería","Soria","Badajoz","Badajoz",4,"Guerra Civil España"]
[9,"En 1956, España abandona el Protectorado de Marruecos. Sin embargo, en 1958 se produce un enfrentamiento bélico ambos por un enclave español en territorio marroquí"," ¿ Cuál ?","Melilla","Ifni","Ceuta","Tarfaya","Ifni",2,"Guerra Civil España"]
[10,"¿ Cuál fue la postura prácticamente unánime de la Iglesia Católica durante el conflicto ?",null,"Apoyó a los sublevados de Francisco Franco","Defendió la legitimidad del gobierno de la Republica","Trato de impedir a toda costa el conflicto y la lucha armada","Se mantuvo neutral","Apoyó a los sublevados de Francisco Franco",1,"Guerra Civil España"]
[11,"Uno de los detonantes de la guerra fue el asesinato del príncipe Francisco Fernándo de Austria, heredero de la Corona austrohúngaro. ","¿ Dónde se produjo el magnicidio ?","Mostar","Sarajevo","Montenegro","Belgrado","Sarajevo",2,"Historia La Primera Guerra Mundial"]
[12,"A la Gran Guerra están unidos varios nombres de políticos y militares de gran importancia en el transcurso del conflicto. ","¿ Cuál de los siguientes no forman parte de esos estadistas ?","Mariscal Fernándo Foch","Guillermo II de Alemania","Francisco José de Austria","Winston Churchill","Winston Churchill",4,"Historia La Primera Guerra Mundial"]
[13,"¿ Que país europero había sido el gran perdedor en el periodo colonialista pero que en cambio alcanzó una gran relevancia en el continente, tratando de imponer su dominio en la Gran Guerra ?",null,"Rusia","Gran Bretaña","Alemania","Francia","Alemania",3,"Historia La Primera Guerra Mundial"]
[14,"La división del imperio austrohúngaro supuso el nacimiento de una serie de nuevos países. ","¿ Cuál de los siguientes no nació de la desmembración de este imperio ?","Checolovaquia","Yugoslavia","Turquía","Polonia","Turquía",3,"Historia La Primera Guerra Mundial"]
[15,"¿ Cuál de los siguientes países, firmantes en su día de la Triple Alianza, rompió el acuerdo para unirse a la Triple Entente al comienzo de la guerra ?",null,"Rusia","Italia","Hungría","Francia","Italia",2,"Historia La Primera Guerra Mundial"]
[16,"Tras el final del conflicto bélico las naciones combatientes crearon un organismo internacional para garantizar la seguridad de la zona y el cumplimiento de los tratados de paz. ","¿ Qué nombre se le dio a esa institución ?","Sociedad de Naciones","Foro de Cooperación Europea","Organización de Naciones Unidas","Consejo de Versalles","Sociedad de Naciones",1,"Historia La Primera Guerra Mundial"]
[17,"En qué año dio comienzo la Primera Guerra Mundial ?",null,1917,1907,1911,1914,1914,4,"Historia La Primera Guerra Mundial"]
[18,"¿ Cuál fue la posición del Imperio Turco en la Primera Guerra Mundial ?",null,"Se mantuvo neutral","Formó parte de la Entente junto a Francia, Inglaterra y Rusia","Ayudó a los Imperios Centrales","Aprovechó para expandir su dominio sobre Oriente","Ayudó a los Imperios Centrales",3,"Historia La Primera Guerra Mundial"]
[19,"Alemania se vio obligada a pagar los gastos de la guerra por lo que su más importante región minera quedó en manos de Francia para su usufructo. ","¿ De que zona se trataba ?","Renania","Alsacia y Lorena","Turingia","Sarre","Sarre",4,"Historia La Primera Guerra Mundial"]
[20,"La división del imperio otomano supuso el nacimiento de una serie de nuevos países. ","¿ Cuál de los siguientes no nació de la desmembración de este imperio ?","Siria","Egipto","Palestina","Iraq","Egipto",2,"Historia La Primera Guerra Mundial"]
[21,"Indica cuál de las siguientes palabras está escrita incorrectamente",null,"digestible","bisel","vullicio","moribundo","vullicio",3,"Lengua"]
[22,"Indica cuál de las siguientes palabras está escrita incorrectamente",null,"subsidio","tuvieron","prohibir","hervir","prohibir",3,"Lengua"]
[23,"Indica cuál de las siguientes palabras está escrita incorrectamente",null,"habitavle","distribuir","apreciabais","burro","habitavle",1,"Lengua"]
[24,"Ordena las siguientes etapas del arte islámico",null,"Califato Omeya. Nazarí. Al-Ándalus","Nazari. Califato Omeya. Al-Ándalus","Califato Omeya. Al-Ándalus. Nazarí.","Nazarí. Al-Ándalus. Califato Omeya","Califato Omeya. Al-Ándalus. Nazarí.",3,"El arte islámico"]
[25,"Los ataurique y capiteles del conjunto arquitectónico de Medina Azahara se caracterizan por su detallismos y claroscuro muy marcado.","¿ Cómo se denomina esta talla ?","Talla de  orfebreria","Talla de avispero","Talla polilobulada","Talla Nasjí","Talla de avispero",2,"El arte islámico"]
[26,"¿ Qué es el ataurique ?",null,"Método de pintura que utiliza yeso","Construcción con estructura de madera","Representación de Alá","Decoración con yeso con formas de tipo vegetal","Decoración con yeso con formas de tipo vegetal",4,"El arte islámico"]
[27,"¿ Cómo es un arco que está enjarjado ?",null,"El arco cuyas dovelas inferiores están horizontales hasta cierta altura","El que tiene dos centros en la línea de las impostas y otro por debajo de ella","El que tiene sus salmeres a distinta altura","El formado por cuatro segmentos de arco de círculo","El arco cuyas dovelas inferiores están horizontales hasta cierta altura",1,"El arte islámico"]
[28,"¿ Qué es un modillón ?",null,"La parte de la cornisa en forma de S al revés que sirve de adorno pareciendo que la sostiene","Adorno que usa en pintura y arquitectura o esculplido que representa una hoja o una flor","La parte ancha de la sección central de un establamento","Ornamentación que termina en forma de follaje como hojas salientes y enrolladas en su extremidad","La parte de la cornisa en forma de S al revés que sirve de adorno pareciendo que la sostiene",1,"El arte islámico"]
[29,"¿ Cómo son los arcos mistilíneos ?",null,"Formados por pequeños arquillos","Tienen un perfil con formas curvas y rectas","Con cuatro segmentos de arco de círculo","Con salmeres a distinta altura","Tienen un perfil con formas curvas y rectas",2,"El arte islámico"]
[30,"Los almohades utilizaban en su decoración la sebqa.","¿ En qué consiste ?","Diferentes formas geométricas y vegetales","Caligrafía del Corán","Conjunto de arcos ciegos","Retícula de rombos","Retícula de rombos",4,"El arte islámico"]
[31,"¿ Qué es la quibla ?",null,"Nicho en el centro de la quibla y que es el lugar simbólico del Profeta  donde se colocan el Corán","Fuente en la se realizan abluciones o limpiezas rituales antes de la oración","La torre desde la que almédano o muecín llama a la oración","El muro que esta orientado a La Meca","El muro que esta orientado a La Meca",4,"El arte islámico"]
[32,"En las mezquitas árabes, ¿ qué es el Sabil ?",null,"Fuente en la que se realizan abluciones o limpiezas rituales antes de la oración","El muro que está orientado a La Meca","La sala de la oración","Lugar reservado para el califa","Fuente en la que se realizan abluciones o limpiezas rituales antes de la oración",1,"El arte islámico"]
[33,"En la arquitectura árabe es común decorar la enjuta o albanega.","¿ Que parte de los edificios es ésta ?","El estanque de agua que se ubica en el patio central","La parte externa de la balconada de la segunda planta de las mezquitas","La parte inferior de los muros","La superficie delimitada por parte externa de una arco y el alfiz que lo enmarca","La superficie delimitada por parte externa de una arco y el alfiz que lo enmarca",4,"El arte islámico"]
[34,"¿ Quién fue el primer líder de la Federación Rusa tras la caída del comunismo y la desmembración de lo que fue la Unión Soviética ?",null,"Dmitri Medvédev","Mijaíl Gobachov","Borís Yeltsin","Vladímir Purtin","Borís Yeltsin",3,"Historia El Comunismo"]
[35,"El líder Mijaíl Gorbachov, con su llegada al poder de la URSS en los años ochenta impone su plan denominado perestroika, que le valdría el Nobel de la Paz en 1990.","¿ Qué significa ese término ruso ?","Reforma","Transparencia","Libertad","Apertura","Reforma",1,"Historia El Comunismo"]
[36,"¿ Cómo se denomina la línea política defendida por Stalin y que mantenía que era posible una URSS socialista rodeado de un mundo capitalista ?",null,"Revolución permanente","Perestroika","Soviet de la Unión","Socialismos en un solo país","Socialismos en un solo país",4,"Historia El Comunismo"]
[37,"El régimen comunista de China disolvió en 1989 unas manifestaciones contra el régimen en la Plaza de Tian'anmen produciendo una masacre que conmocionó al mundo.","¿ Quiénes se manifestaban ?","Mujeres","Estudiantes","Sindicalistas","Campesinos","Estudiantes",2,"Historia El Comunismo"]
[38,"Varios países de la órbita soviética adaptaron su modelo de economía comunista, como fue el caso de Rumanía bajo la dictadura de...",null,"Nicolae Ceaucescu","Mariscal Tito","Omer Nishani","Slobodan Milosevic","Nicolae Ceaucescu",1,"Historia El Comunismo"]
[39,"Para el Partido Socialdemócrata Ruso, fudado a finales del XIX,","¿ quién debía ser la base de una revolución para conquistar el poder ?","El clero","La clase obrera","Los campesinos ","Loa aristócratas","La clase obrera",2,"Historia El Comunismo"]
[40,"La URSS ha aportado varios Nobel de Literatura a la Historia, pero casi todos terminaron exiliados de la represión soviética.","¿ Cuál de los siguientes Nobel fue en cambio fiel al régimen, ocupando puestos de responsabilidad en el Partido ?","Mijaíl Shñolojov","Alexander Solzhenitsin","Iván Bunin","Boris Pasternak","Mijaíl Shñolojov",1,"Historia El Comunismo"]
[41,"El gran rival de Stalin fue León Trotsky, que fue obligado a exiliarse a México en 1929. Allí fue asesinado por un espía de Stalin nacido en Barcelona.","¿ Cuál era su nombre ?","Valentín Moix","Ramón Mercader","Víctor Andrade","José Gallizo","Ramón Mercader",2,"Historia El Comunismo"]
[42,"Durante el largo mandato de Leonid Brézhnez, la URSS decidió invadir un país de su influencia para apoyar su régimen comunista. EE.UU., por su parte, ayudaría a este país en la guerra.","¿ Cuál era ?","Pakistán","Uzbekistán","Kazajistan","Afganistán","Afganistán",4,"Historia El Comunismo"]
[43,"En 1968, Checoslovaquia eligió como su líder a Alexander Dubcek, que propuso cambios democráticos en el país, algo a lo que la URSS se opuso atacando militarmente el país.","¿ Cómo se conoce a es momento ?","Perestroika","Primavera de Praga","Revolución de los Claveles","Bloqueo de los Suspiros","Primavera de Praga",2,"Historia El Comunismo"]
[44,"¿ Cuándo podemos hablar estrictamente de energía transmitida por radiación ?",null,"En la energía atómica","En campos eléctricos","En el vacio","En un cuerpo líquido","En el vacio",3,"El calor y la temperatura"]
[45,"¿ Cómo se denominan a aquellos materiales que son malos transmisores del calor ?",null,"Convectores","Refrigerantes","Conductores","Aislantes","Aislantes",4,"El calor y la temperatura"]
[46,"¿ Cuándo se produce la dilatación de un cuerpo, ya sea un sólido, un líquido o un gas ?",null,"Al aumentar la presión","Al aumentar su densidad","Al cambiar de estado","Por el cambio de temperatura","Por el cambio de temperatura",4,"El calor y la temperatura"]
[47,"El calor puede influir en el cambio de estados de la materia."," ¿ Cómo se denomina a la transformación por efecto del calor de un estado sólido a gaseoso sin pasar por el líquido ?","Sublimación","Fusión","Vaporización","Condensación","Sublimación",1,"El calor y la temperatura"]
[48,"¿ Qué necesita más intercambio ( cesión o absorción) de calor, convertir el agua de una cubitera en hielo o convertir ese hielo de nuevo en agua ?",null,"Depende de la temperatura de los cubitos","Convertir el agua en cubitos","El deshielo de los cubitos","El mismo","El mismo",4,"El calor y la temperatura"]
[49,"¿ Cuál es el modo en el que se transmite el calor en los objetos sólidos ?",null,"Inducción","Conducción","Radiación","Convección","Conducción",2,"El calor y la temperatura"]
[50,"¿ Cuál es el instrumento utilizado por los científicos para medir temperaturas a la que se encuentra la materia ?",null,"Termoscopio","Termómetro","Calorímetro","Termostato","Termómetro",2,"El calor y la temperatura"]
[51,"¿ Cuál de las siguientes afirmaciones sobre el calor y la temperatura no es cierta ?",null,"Un cuerpo a más temperatura tiene más capacidad de ceder calor a otro","El calor que desprende un objeto es indepediente de su masa","El tipo de material influye en el calor desprendido o absorbido por un cuerpo","Los cuerpos no tienen calor","El calor que desprende un objeto es indepediente de su masa",2,"El calor y la temperatura"]
[52,"Dentro del Sistema Internacional,","¿ cuál es la unidad oficial con la que se mide el calor ?","Caloría","Julio","Grado Kelvin","Grador Celsius","Julio",2,"El calor y la temperatura"]
[53,"Bajo qué nombre denominó Bertrand Russell a la relación entre la realidad y el lenguaje ?",null,"Principio de individuación","Giro lingüstico","Dialéctica serial","Atomismo lógico","Atomismo lógico",4,"Filosofía del lenguaje"]
[54,"¿ Cuál de las siguientes proposiciones son \" sin sentido \" ( sinnlos ) dentro de la teoría del lenguaje de Wittgenstein ?",null,"Es bueno ayudar a los demás","2 más 2 es igual a 4","Los unicornios pastan en la pradera","El Guernica es un cuadro muy bonito","2 más 2 es igual a 4",2,"Filosofía del lenguaje"]
[55,"En el Wittgenstein de la segunda etapa,","¿ cuál ha de ser el objetivo de la filosofía?","Describir","Descubrir los límites del lenguaje","Proponer teorías sobre el mundo que nos rodea","Determinar qué es verificable y qué no","Describir",1,"Filosofía del lenguaje"]
[56,"Para Wittgenstein,","¿ qué se encuentra dentro del espacio lógico ?","Todas las proposiciones verdaderas y falsas","Todas las proposiciones falsas","Todas las proposicones verdaderas","Todas las proposiciones verdaderas del munto real","Todas las proposiciones verdaderas y falsas",1,"Filosofía del lenguaje"]
[57,"¿ Cuál de las siguientes afirmaciones sobre la teoría figurativa del sentido de Wittenstein no es correcta ?",null,"Una proposición ha de compartir la misma estructura que aquello que describe","Una proposición se articula de una forma lógica","Comprender una proposición es comprender el hecho que ella describe","El lenguaje debe permitirnos descubrir la estructura de lo real","El lenguaje debe permitirnos descubrir la estructura de lo real",4,"Filosofía del lenguaje"]
[58,"En el siglo XIX se produjo en España un proceso por el cual las tierras y edificios en = manos muertas \" ( Iglesias y órdenes religiosas) pasasaban a manos del Estado, pudiéndose así reorganizar el interior de las ciudades.","¿ Cómo se llamó a ese proceso ?","Desamortización","Privación patrimonial","Espropiación","Confiscación","Desamortización",1]
[59,"Una característica habitual del urbanismo español es la presencia de las plazas mayores en el centro de la urbe como punto de encuentro entre ciudadanos.","¿ En qué época tuvo lugar ese florecimiento de plazas ?","Siglo XX","Edad Moderna","Edad Media","Edad Contemporánea","Edad Moderna",2,"Geografía las ciudades de España"]
[60,"Ante los problemas actuales de acceso a la vivienda debido a su alto precio, las Administraciones públicas españolas ofrecen pisos a las rentas menores para que puedad acceder a una vivienda digna.","¿ Qué nombre reciben ?","Vivienda de Inserción","Vivienda de Protección Oficial","Vivienda a Precio Tasado","Vivienda de Ayuda Social","Vivienda de Protección Oficial",2,"Geografía las ciudades de España"]
{"$rows_left_out":922}
{"sheet":"Hoja2","index":1,"n_rows":19,"n_cols":9,"rows_kept":19,"cut":false,"hidden":false,"merged":[[3,5,3,6],[4,5,4,6],[5,5,5,6],[6,5,6,6],[2,5,2,6]]}
[null,null,null,null,{"$f":"E13","v":0},null,null,{"$f":"VLOOKUP(I2,Hoja1!A1:J400,9,FALSE)","v":1},100]
[null,null,null,null,"¿ Cómo perdió Miguel de Cervantes el movimiento de la mano izquierda ?",null,null,null,100]
["jugadores",null,null,null,0]
["nombre ?",null,1,{"$f":"IF(C4=$H$1,\"si\",\"no\")","v":"si"},"En una reyerta callejera",1]
["?",null,null,{"$f":"IF(C5=$H$1,\"si\",\"no\")","v":"no"},"En una apuesta"]
["?",null,null,{"$f":"IF(C6=$H$1,\"si\",\"no\")","v":"no"},"Como guarda real de Felipe V",3]
["?",null,null,{"$f":"IF(C7=$H$1,\"si\",\"no\")","v":"no"},"En la Batalla de Lepanto",4]
[]
[]
[]
[]
[]
[null,null,null,null,{"$f":"VLOOKUP(Hoja4!CF9,Hoja1!A1:J383,10,FALSE)","v":0}]
[null,null,null,null,{"$f":"VLOOKUP(Hoja4!CF9,Hoja1!A1:H997,2,FALSE)","v":"¿ Cómo perdió Miguel de Cervantes el movimiento de la mano izquierda ?"}]
[null,null,null,null,{"$f":"VLOOKUP(Hoja4!CF9,Hoja1!A1:J997,3,FALSE)","v":0}]
[null,null,null,null,{"$f":"VLOOKUP(Hoja4!CF9,Hoja1!A1:H997,4,FALSE)","v":"En una reyerta callejera"}]
[null,null,null,null,{"$f":"VLOOKUP(Hoja4!CF9,Hoja1!A1:H997,5,FALSE)","v":"En una apuesta"}]
[null,null,null,null,{"$f":"VLOOKUP(Hoja4!CF9,Hoja1!A1:H997,6,FALSE)","v":"Como guarda real de Felipe V"}]
[null,null,null,null,{"$f":"VLOOKUP(Hoja4!CF9,Hoja1!A1:H997,7,FALSE)","v":"En la Batalla de Lepanto"}]

{"sheet":"Hoja3","index":2,"n_rows":1,"n_cols":4,"rows_kept":1,"cut":false,"hidden":true,"merged":[]}
[{"$f":"Hoja2!A4","v":"nombre ?"},{"$f":"Hoja2!A5","v":"?"},{"$f":"Hoja2!A6","v":"?"},{"$f":"Hoja2!A7","v":"?"}]

{"sheet":"Hoja4","index":3,"n_rows":88,"n_cols":84,"rows_kept":88,"cut":false,"hidden":false,"merged":[[39,2,45,79],[21,83,23,85],[24,83,24,85],[8,83,10,85],[13,83,17,85],[24,2,28,79],[92,0,92,81],[61,39,69,43],[61,44,70,74],[47,2,57,7],[52,81,57,82],[64,81,69,82],[82,34,91,41],[81,16,91,22],[47,8,58,37],[47,46,58,74],[62,8,70,37],[47,39,57,45],[0,80,90,80],[62,2,69,7],[0,0,91,1],[29,2,38,79]]}
[]
[]
[]
[]
[]
[]
[]
[]
[null,null,null,null,null,null,null,null,null,null,null,null,null,null,null,null,null,null,null,null,null,null,null,null,null,null,null,null,null,null,null,null,null,null,null,null,null,null,null,null,null,null,null,null,null,null,null,null,null,null,null,null,null,null,null,null,null,null,null,null,null,null,null,null,null,null,null,null,null,null,null,null,null,null,null,null,null,null,null,null,null,null,null,339]
[]
[]
[]
[]
[null,null,null,null,null,null,null,null,null,null,null,null,null,null,null,null,null,null,null,null,null,null,null,null,null,null,null,null,null,null,null,null,null,null,null,null,null,null,null,null,null,null,null,null,null,null,null,null,null,null,null,null,null,null,null,null,null,null,null,null,null,null,null,null,null,null,null,null,null,null,null,null,null,null,null,null,null,null,null,null,null,null,null,{"$f":"VLOOKUP(CF9,Hoja1!A1:J382,9)","v":4}]
[]
[]
[]
[]
[]
[]
[]
[null,null,null,null,null,null,null,null,null,null,null,null,null,null,null,null,null,null,null,null,null,null,null,null,null,null,null,null,null,null,null,null,null,null,null,null,null,null,null,null,null,null,null,null,null,null,null,null,null,null,null,null,null,null,null,null,null,null,null,null,null,null,null,null,null,null,null,null,null,null,null,null,null,null,null,null,null,null,null,null,null,null,null,{"$f":"RANDBETWEEN(1,382)","v":170}]
[]
[]
[null,null,{"$f":"Hoja2!E13","v":0}]
[]
[]
[]
[]
[null,null,{"$f":"Hoja2!E14","v":"¿ Cómo perdió Miguel de Cervantes el movimiento de la mano izquierda ?"}]
[]
[]
[]
[]
[]
[]
[]
[]
[]
[null,null,{"$f":"Hoja2!E15","v":0}]
[]
[]
[]
[]
[]
[]
[]
[null,null,1,null,null,null,null,null,{"$f":"Hoja2!E16","v":"En una reyerta callejera"},null,null,null,null,null,null,null,null,null,null,null,null,null,null,null,null,null,null,null,null,null,null,null,null,null,null,null,null,null,null,2,null,null,null,null,null,null,{"$f":"Hoja2!E17","v":"En una apuesta"}]
[]
[]
[]
[]
[]
[]
[]
[]
[]
[]
[]
[]
{"$rows_left_out":28}