{"text_format":"1","workbook":"xlsx","n_sheets":4,"sheets":["PROBLEMAS RUBIO","APUNTES","Hoja1","raiz"],"not_rendered":{"charts":0,"images":3,"macros":1,"external_links":0,"defined_names":0,"comments":0,"pivot_tables":0},"unopened":[],"bounds":{"document_bytes":16777216,"sheet_cells":100000,"rows_first":2000,"rows_last":500,"rows_between":2000,"halvings":0,"cell_chars":16384,"cell_head_chars":4096},"cells_cut":0,"cells_raw":0,"read":"whole","date_system":"1900"}

{"sheet":"PROBLEMAS RUBIO","index":0,"n_rows":11,"n_cols":25,"rows_kept":11,"cut":false,"hidden":false,"merged":[[22,0,22,2],[15,0,15,2],[16,0,16,2],[8,13,9,14],[13,0,13,2],[14,0,14,2],[16,4,16,9],[12,3,12,5],[13,3,13,5],[14,3,14,5],[18,4,18,9],[19,4,19,9],[17,4,17,9],[16,13,16,15],[17,13,17,15],[18,13,18,15],[5,24,5,26],[14,6,14,9],[14,10,14,13],[8,0,9,12],[11,0,11,2],[13,6,13,9],[11,6,11,9],[12,6,12,9],[13,10,13,13],[11,10,11,13],[12,10,12,13],[11,3,11,5],[3,0,7,19],[8,15,9,18],[12,0,12,2],[17,0,17,2],[18,0,18,2],[19,0,19,2],[16,10,16,12],[17,10,17,12],[18,10,18,12],[19,10,19,12],[20,10,20,12],[21,13,21,15],[19,13,19,15],[20,13,20,15],[21,0,21,2],[21,4,21,9],[21,10,21,12],[20,4,20,9],[20,0,20,2]]}
[]
[]
[]
[{"$f":"VLOOKUP(X4,APUNTES!A1:C100,2,FALSE)","v":"Un horno continuo cuece 30.360 ladrillos cada día. ¿ Cuál es su rendimiento por hora ?"},null,null,null,null,null,null,null,null,null,null,null,null,null,null,null,null,null,null,null,null,null,null,2]
[null,null,null,null,null,null,null,null,null,null,null,null,null,null,null,null,null,null,null,null,null,null,null,1]
[null,null,null,null,null,null,null,null,null,null,null,null,null,null,null,null,null,null,null,null,null,null,null,null,{"$f":"VLOOKUP(X4,APUNTES!A1:D100,4,FALSE)","v":1265}]
[]
[]
[{"$f":"VLOOKUP(X4,APUNTES!A1:D100,3,FALSE)","v":"rendimiento por hora"},null,null,null,null,null,null,null,null,null,null,null,null,null,null,{"$f":"VLOOKUP(X4,APUNTES!A1:E100,5,FALSE)","v":"ladrillos"}]
[]
[null,null,null,"sumas"]

{"sheet":"APUNTES","index":1,"n_rows":2094,"n_cols":5,"rows_kept":2094,"cut":false,"hidden":true,"merged":[]}
[1,"Hemos comprado una motocicleta usada por 8.945 peseta y nos descuentan 635 pesetas por pagarla al contado. Al repararla invertimos 2.174 pesetas y 395 pesetas en un faro nuevo. ¿ Por cuánto debemos venderla para ganar 3.234 pesetas en la operación ?","dependiendo si ponemos lo que nos descuentan:  venderla por ",14113,"pesetas"]
[2,"Un horno continuo cuece 30.360 ladrillos cada día. ¿ Cuál es su rendimiento por hora ?","rendimiento por hora",1265,"ladrillos"]
[3,"Si tres mesas cuestan 252 pesetas. Con 1.008 pesetas, ¿ cuántas mesas compraremos ?","compramos",12,"mesas"]
[4,"Un relojero compone 2 series de relojes artísticos. La primera serie consta de 24 relojes con 31 piezas cada uno y la segunda de 18 relojes con 426  piezas cada uno.  ¿ Cuántas piezas utilizó entre todos los relojes ?","utilizó",8412,"piezas"]
[5,"Para una campaña publicitaria se distribuyeron 7.688 artículos entre dos señoritas. Mientras una repartía 34 artículos por hora, la otra tan sólo entregaba 28. ¿ Cuántas horas duró la campaña ?","la campaña duró",500.69,"horas"]
[6,"Una presa recibió en tres años: 45.564,     86.592,   y     57.215 metros cúbicos de agua, respectivamente. De haber llovido con regularidad, debería almacenar 245.268 metros cúbicos.  ¿Cuántos metros cúbicos de menos hay por falta de lluvia ?","metros cúbicos",55897,"de menos"]
[7,"Si un oso pesa 124 kilos igual al peso de 4 monos ¿ Cuánto pesan, en conjunto, el oso y 3 monos?","el oso y 3 monos pesan",217,"kilos"]
[8,"Un tren marcha a 76 kilómetros por hora y otro a 59. ¿ Cuántos kilómetros llevará de delantera el primero al segundo al cabo de 13 horas ?","le llevará de delantera",221,"kilómetros"]
[9,"En un plato había 12 albaricoques y en otro 50 cerezas. Por cada 5 cerezas que yo como, mi hermano se come un albaricoque. Si yo me he comido todas las cerezas, ¿ cuántos albaricoques han sobrado ?","han sobrado",2,"albaricoques"]
[10,"Una siderúrgica posee 4 almacenes con 2.358 lingotes de hierro cada uno. Para llevarlos al puerto se utiliza una vagoneta capaz de transportar 9 lingotes cada vez. ¿ Cuántos viajes hará la vagoneta ?","hará",1048,"viajes"]
[11,"Un elefante pesa 1.236 kilos. Un león pesa la cuarta parte que el elefante. Cuánto pesan entre los   dos ?","el elefante y el león pesan",1545]
[12,"Para la contención de tierras se ha construido un muro escalonado. En el primer tramo se utilizarón 8.425 bloques de cemento; en el segundo, 1.218 menos que en el primero, y en el tercero 692 más que en el segundo. Cuántos bloques de cemento se emplearon en total ?","se emplearon un total de",23531,"bloques"]
[13,"En un invernadero se cortan 354 flores diarias, mientras que en un campo, al aire libre, 750 cada 3 días. Al cabo de 30 días, ¿ cuántas flores más se cortarán en el invernadero que en el campo ?","se cortarán en el invernadero",3120,"más que en el campo"]
[14,"Con 46 cocos hemos obtenido 1.564 tajadas. Cuántas tajadas obtendremos con 3 cocos ?","obtendremos",102,"tajadas"]
[15,"Un camión puede cargar hasta 8.100 kilos y sólo lleva la mitad. ¿ Cuántos sacos de 75 kilos podremos cargar todavía ?","podremos cargar",54,"sacos"]
[16,"Un puente estaba calculado para soportar 50.430 toneladas. En una prueba de resistencia se le cargó este peso más un quinto. ¿ Cuántas toneladas soporta como mínimo ?","soporta como mínimo",60516,"toneladas"]
[17,"Si tuviera 57 duros más de los que tengo podría comprar un armario que cuesta 4.257 pesetas. Cuánto dinero poseo ?","1 duro = a 5 pesetas                poseo",3972,"pesetas"]
[18,"Si una garrafa de vino de 32 litros cuesta 1664 pesetas. Determinar el valor de 28 litros.","28 litros cuestan",1456,"pesetas"]
[19,"Un ganadero tiene 24 vacas que le producen 8 litros de leche cada una por día, y 15 cabras que, entre todas, le producen 27 litros de leche diariamente. ¿ Cuántos litros de leche obtendrá en un día ?","en un día obtendra",219,"litros de leche"]
[20,"Un joven que tenía 12 años en 1.978, ¿ en qué año cumplirá 28 ?","en el año",1994,"tendrá 28 años"]
[21,"De Madrid a Valencia hay 405 Km. por ferrocarril pasando por Cuenca, y el billete de 2.ª clase cuesta 731 pts. Con 8 pts., se puede hacer un trayecto de 5 Km. viajando en autobús.  ¿ Qué medio de locomoción resulta más económico ?","el autobús nos cuesta",810,"pesetas"]
[22,"Mi cometa tiene 540 metros de hilo y la de Felipe 460. Si queremos que las dos cometas vuelen igual de altas, ¿ cuántos metros de hilo he de quitar a mi cometa para dárselos a Felipe ?","he de darle a Felipe",80,"metros de hilo"]
[23,"Si para obtener 8 kilos de trigo hacen falta 15 gavillas, ¿ cuántos kilos de trigo se obtendrán con 1.245 gavilla ?","se obtendrán",664,"kilos de trigo"]
[24,"Las tres vegas que rodean un castillo están plantadas de perales. En la primera se contaron 8.142 perales, en la segunda 758 más que en la primera, y en la tercera, tantos como en las dos anteriores juntas. ¿ Cuántos perales hay entre todos ?","hay en total",17800,"perales"]
[25,"Si 4 tubos de pasta de dientes valen 128 pesetas. ¿ Cuánto cuestan 5 tubos ?","cuestan",160,"pesetas"]
[26,"Un montacargas pesa vacio 125 kilos y con la mitad de la carga que admite pesa 335 kilos. ¿ Cuánto pesa la carga que admite todavía ?","la carga que admite son",210,"kilos"]
[27,"Un comerciante compró 74 sacos de sal de 82 kilos cada uno. Después de vender 2.351 kilos y haber regalado 3 sacos, ¿ cuántos kilogramos de sal le quedaron. ?","le quedaron",3471,"kilos de sal"]
[28,"¿ Cuántos medios siglos son 1.000 años ?","son",5,"medios siglos"]
[29,"Un motorista para recorrer un trayecto en 6 horas ha de ir a 35 kilómetros por hora. ¿ Cuántas horas tardará en recorrer el mismo trayecto si fuera a 70 kilómetros por hora ?","tardará",12,"horas"]
[30,"Suponiendo que 3 kilos de uva proporcionan 2 litros de vino, ¿ cuántos kilogramos de uva harán falta para llenar una cuba de 1.632 litros ?","harán falta",1088,"kilos de uva"]
[31,"Una fortaleza defendida por 245 hombres consumen 4 kilos de pan cada uno a la semana. ¿ Cuántos kilos de pan consumen diariamente en la fortaleza ?","consumen cada día",140,"kilos de pan"]
[32,"En la cuestación para el cáncer entregaron 4.278 banderitas a 3 señoritas, que se las repartieron por igual. Al final de la jornada, les sobraron 246 banderitas a cada una. ¿ Cuántas repartió cada una ?","cada una repartió",1180,"banderitas"]
[33,"Un equipo de científicos construyó 5 decenas de máquinas proto-tipo, después de 6.300 horas de trabajo, ¿ Cuántas horas invirtieron en cada máquina ?","invirtieron",126,"horas"]
[34,"35 alumnos han de resomver 5 problemas cada uno. Si entre todos ha hecho 43 problemas mal, ¿ cuántos son los problemas que han hecho bien entre todos ?","han hecho bien",132,"problemas"]
[35,"Un río se desliza por 475 kilómetros de zonas montañosas y 715 de zonas llanas. Si además, le faltan 123 kilómetros para desembocar en el mar, ¿ cuántos kilómetros tiene de curso este río ?","tiene de curso",1313,"kilómetros"]
[36,"De una mina se extraen 2.342 toneladas de mineral y 215 de rocas cada mes. ¿ Cuántas toneladas se estraerán, normalmente en un año, entre mineral y roca ?","se extraerán",933305,"toneladas"]
[37,"Un automóvil para recorrer un trayecto en 8 horas ha de ir a 60 kilómetros por hora. ¿ Cuántas horas tardaría en recorrer el mismos trayecto si fuera a 40 Km. por hora ?","tardará",12,"horas"]
[38,"Si 6 melones cuestan 936 pesetas. Calcular el valor de 3 melones","cuestan",468,"pesetas"]
[39,"Con la uva de una cosecha se llenaron 6 secaderos con un total de 12.314 canastas. Una vez convertidas en pasas, de cada secadero, se obtuvieron 1.243 canastas. ¿ En cuántas canastas disminuyó la uva ?","disminuyó",4856,"canastas"]
[40,"Una fuente mana 9.240 litros de agua diariamente y otra 6.576 litros. ¿ Cuántos litros por hora mana más la primera fuente que la segunda ?","mana",111,"litros de más"]
[41,"Un agricultor pudo vender 875 kilos de peras a 14 pesetas el kilo. Rechazó la oferta, y después de habérsele pudrido 75 kilos vendió las restantes a 17 pesetas el kilo. Averiguar la ganancia o pérdida comparando con el precio a que pudo realizar la venta.","tuvo una ganancia de",1350,"pesetas"]
[42,"Una pieza de 32 metros de tela vale 13.280 pesetas, ¿ Cuánto me costarán los 3 metros que necesito para un traje ?","los 3 me costarán",1245,"pesetas"]
[43,"Un incendio forestal destruye 4.025 árboles por hora. Si está localizado en un bosque con 150.000 árboles, ¿ cuántos quedaron útiles, si el incendio duró 22 horas ?","quedaron",61450,"árboles"]
[44,"Con la lana de 100 ovejas se obtienen 5 cajas de 60 ovillos cada una.    ¿ Cuántos ovillos produce cada oveja ?","producen",3,"ovillos"]
[45,"Un turismo consume 12 litros de gasolina cada hora. Si un avión consume 6 veces más que el turismo.       ¿ Cuánto consumen entre los dos en 3 horas ?","entres los dos consumen",252,"litros"]
[46,"Al final de la campaña, una  factoria de encendedores, ha servido 254 cajas por avión, 315 por ferrocarril y 512 por carretera. Si cada caja contenía 37 encendedores, ¿ cuántos sirvió en total ?","sirvió en total",39997,"encendedores"]
[47,"En los toros embolados de mi pueblo participaron 628 mozos. Si al final de la fiesta se marcharon 4 autobuses con 68 jóvenes en cada uno, ¿ cuántos quedaron en el pueblo ?","en el pueblo quedaron",356,"mozos"]
[48,"Un granjero vende 2 gallinas y un conejo por 1.150 pesetas. Si cada gallina vale 356 pesetas, ¿ cuánto vale el conejo ?","el conejo vale",438,"pesetas"]
[49,"1.250 reclutas han jurado bandera y salen de permiso en 22 autocares de 54 plazas cada uno. ¿ Cuántos soldados irán sentados y cuántos de pie ?","  62 de pie",1188,"soldados sentados"]
[50,"Para cargar 20 cajas de 25 cartuchos cada una, se necsitan 31.500 perdigones. ¿ Cuántos perdigones tienen cada cartucho ?","cada cartucho tiene",63,"perdigones"]
[51,"Si una lata de 80 litros de gasolina cuesta 4.800 pesetas. ¿ Cúal es el valor de una lata de 5 litros ?","la lata de 5 litros cuesta",300,"pesetas"]
[52,"En los 7 estantes de una bodega hay 1.638 botellas. ¿ Cuántas botellas hay en 2 estantes ?","hay un total de",468,"botella"]
[53,"Tenemos 445 pesetas y queremos comprar 6 lápices de 32 pesetas cada uno y 7 pelotas de 45 pesetas cada una. ¿ Cuánto dinero nos hace falta para realizar las compras ?","nos faltan",62,"pesetas"]
[54,"Un cine tiene 650 butacas de patio de 125 pesetas y 230 butacas de piso de 85 pesetas cada una, respectivamente. ¿ Cuánto se recaudará en un día festivo que se vendan todas las entradas de las dos sesiones ?","se recauda en las dos sesione",201600,"pesetas"]
[55,"Si con 5 Kg. de harina se pueden obtener 7 kilos de pasteles, ¿ cuántos kilos de pasteles se fabricarán con 135 kilos de harina ?","toptal kilos",189,"pasteles"]
[56,"Un poste que mide 2 metros proyecta una sombra de 1,10 metros. ¿ Qué altura tendrá una torre que en el mismo momento proyecta una sombra de 22 metros ?","la torre tiene una altura de",12.1,"metros"]
[57,"Un trabajador viene del extranjero con 6.235 francos y 2.360 marcos, y los cambia en un banco a razón de 17 pesetas por franco y 40 pesetas por cada marco. ¿ Cuántas pesetas recibirá ?","recibirá",200395,"pesetas"]
[58,"A un aserradero llegan, diariamente, 45 troncos que traen entre 9 mulas. Si fueran 27 las mulas,                    ¿ cuántos troncos traerían cada día ?","traerán",135,"troncos"]
[59,"Un motorista para recorrer un trayecto en 13 horas ha de ir a 70 kilómetros por hora. ¿ Cuántas horas tardará en recorrer el mismo trayecto si fuera a 65 kilómetros por hora ?","tardará",14,"horas"]
[60,"A un joyero le llegan pulseras de 157 gramos, a las que agrega piedras preciosas hasta que cada pieza alcance los 185 gramos. ¿ Cuántas piezas engarzará con 1.736 gramos de piedras preciosas.","engarzará",62,"piezas"]
[61,"Con el producto de la venta de 5 camisas a 828 pesetas cada una, ¿ cuántos pañuelos podremos comprar a 60 pesetas la unidad ?","podemos comprar",69,"pañuelos"]
[62,"Compramos 43 litros de aceite a 123 pesetas el litro. ¿ A qué precio por litro nos resultará el aceite si hemos perdido 2 litros ?","nos saldrá a",129,"pesetas el litro"]
[63,"Un automóvil sale de Murcia a la una de la tarde y llega a Córdoba a las 11 de la noche. Si ha marchado a una velocidad media de 58 kilómetros por hora, ¿ cuánto tiempo ha estdo parado sabiendo que la distancia entre las dos capitales es de 464 kilómetros ?","ha estado parado",2,"horas"]
[64,"En un saco hay 64 kilos de almendras y en otro 7 kilos más que en el primero. ¿ Cuánto valen las almendras de los dos sacos a  84 pesetas el kilo ?","la almendras el total son:",11340,"pesetas"]
[65,"Un camión tiene que cubrir una distancia de 510 kilómetros en 8 horas. Si durante las 2 primeras horas marcha a 54 kilómetros por hora, ¿ a qué velocidad por hora debe ir durante el tiempo que le queda ?","debe ir a una velocidad de:",67,"kilómetros hora"]
[66,"Un viajante cobra una comisión del 15 % de las ventas realizadas. ¿ Cuál es la ganancia, si ha hecho una venta de 400.000 pestas","la ganancia ha sido de",60000,"pts."]
[67,"Para proyectar una obra de 15.000.000 de pts. Una arquitecto cobra 375.000 pts. ¿ Que porcentaje representa ?","el porcentaje es",2.5,"por ciento"]
[68,"Entre tres personas compran 1 billete de loteria; pagan 700, 800, 1.000 pts. Respectivamente. Si el billete sale premiado en 10.000.000 millones de pts. ¿ Cuánto le corresponde a cada uno ? total billete 2.500 pts.","700 pts.",2800000,"pesetas"]
[69,"Entre tres personas compran 1 billete de loteria; pagan 700, 800, 1.000 pts. Respectivamente. Si el billete sale premiado en 10.000.000 millones de pts. ¿ Cuánto le corresponde a cada uno ? total billete 2.500 pts.","800 pts.",3200000,"pesetas"]
[70,"Entre tres personas compran 1 billete de loteria; pagan 700, 800, 1.000 pts. Respectivamente. Si el billete sale premiado en 10.000.000 millones de pts. ¿ Cuánto le corresponde a cada uno ? total billete 2.500 pts.","1.000 pts.",4000000,"pesetas"]
[71,"Por una factura de 11.995 pesetas nos cobran 11.000 pesetas ¿ Qué tanto por ciento de descuento nos han hecho ?","nos han hecho el ",8.2899999999999991,"por %"]
[72,"Una empresa reparte entre 4 trabajadores 110.000 pts. en partes directamente proporcionales al número de años de antigüedad. Si han estado 24, 18, 15, 6 años respectivamente ¿ Cuánto recibe cada uno ?","al de 24 años corresponde",41904.76,"pesetas"]
[73,"Una empresa reparte entre 4 trabajadores 110.000 pts. en partes directamente proporcionales al número de años de antigüedad. Si han estado 24, 18, 15, 6 años respectivamente ¿ Cuánto recibe cada uno ?","al de 18 años corresponde",31428.57,"pesetas"]
[74,"Una empresa reparte entre 4 trabajadores 110.000 pts. en partes directamente proporcionales al número de años de antigüedad. Si han estado 24, 18, 15, 6 años respectivamente ¿ Cuánto recibe cada uno ?","al de 15 años corresponde",26190.48,"pesetas"]
[75,"Una empresa reparte entre 4 trabajadores 110.000 pts. en partes directamente proporcionales al número de años de antigüedad. Si han estado 24, 18, 15, 6 años respectivamente ¿ Cuánto recibe cada uno ?","al de 6 años corresponde",10476.19,"pesetas"]
[76,"Repartir 64.400 pesetas entre 3 trabajadores sabiendo que el 1º trabajador, trabajó 7 días a razón de 6 horas diarias.  El 2º trabajador 5 días 8 horas diarias.  El 3º trabajador 3 días 10 horas diarias.","al 1º trabajador le corresponde",24150,"pesetas"]
[77,"Repartir 64.400 pesetas entre 3 trabajadores sabiendo que el 1º trabajador, trabajó 7 días a razón de 6 horas diarias.  El 2º trabajador 5 días 8 horas diarias.  El 3º trabajador 3 días 10 horas diarias.","al 2º trabajador le corresponde",23000,"pesetas"]
[78,"Repartir 64.400 pesetas entre 3 trabajadores sabiendo que el 1º trabajador, trabajó 7 días a razón de 6 horas diarias.  El 2º trabajador 5 días 8 horas diarias.  El 3º trabajador 3 días 10 horas diarias.","al 3º trabajador le corresponde",17250,"pesetas"]
[79,"Un autómovil gasta 7 litros de gasolina cada 100 kilómetros. Si tiene un depósito de 45 litros. ¿ Cuántos Kilómetros puede recorrer sin necesidad de repostar ?","recorrerá",642.86,"kilómetros"]
[80,"En una mina obtenían 750 kilos de mineral por cada 100 Kg. de material extraido.  ¿ Cuántos Kg. de material hemos de extraer para obtener 25 toneladas de mineral ?","hay que extraer",33333.33,"kilógramos"]
[81]
[82]
[83]
[84]
[85]
[86]
[87]
[88]
[89]
[90]
[91]
[92]
[93]
[94]
[95]
[96]
[97]
[98]
[99]
[100]
[101]
[102]
[103]
[104]
[105]
[106]
[107]
[108]
[109]
[110]
[111]
[112]
[113]
[114]
[115]
[116]
[117]
[118]
[119]
[120]
[121]
[122]
[123]
[124]
[125]
[126]
[127]
[128]
[129]
[130]
[131]
[132]
[133]
[134]
[135]
[136]
[137]
[138]
[139]
[140]
[141]
[142]
[143]
[144]
[145]
[146]
[147]
[148]
[149]
[150]
[151]
[152]
[153]
[154]
[155]
[156]
[157]
[158]
[159]
[160]
[161]
[162]
[163]
[164]
[165]
[166]
[167]
[168]
[169]
[170]
[171]
[172]
[173]
[174]
[175]
[176]
[177]
[178]
[179]
[180]
[181]
[182]
[183]
[184]
[185]
[186]
[187]
[188]
[189]
[190]
[191]
[192]
[193]
[194]
[195]
[196]
[197]
[198]
[199]
[200]
[201]
[202]
[203]
[204]
[205]
[206]
[207]
[208]
[209]
[210]
[211]
[212]
[213]
[214]
[215]
[216]
[217]
[218]
[219]
[220]
[221]
[222]
[223]
[224]
[225]
[226]
[227]
[228]
[229]
[230]
[231]
[232]
[233]
[234]
[235]
[236]
[237]
[238]
[239]
[240]
[241]
[242]
[243]
[244]
[245]
[246]
[247]
[248]
[249]
[250]
[251]
[252]
[253]
[254]
[255]
[256]
[257]
[258]
[259]
[260]
[261]
[262]
[263]
[264]
[265]
[266]
[267]
[268]
[269]
[270]
[271]
[272]
[273]
[274]
[275]
[276]
[277]
[278]
[279]
[280]
[281]
[282]
[283]
[284]
[285]
[286]
[287]
[288]
[289]
[290]
[291]
[292]
[293]
[294]
[295]
[296]
[297]
[298]
[299]
[300]
[301]
[302]
[303]
[304]
[305]
[306]
[307]
[308]
[309]
[310]
[311]
[312]
[313]
[314]
[315]
[316]
[317]
[318]
[319]
[320]
[321]
[322]
[323]
[324]
[325]
[326]
[327]
[328]
[329]
[330]
[331]
[332]
[333]
[334]
[335]
[336]
[337]
[338]
[339]
[340]
[341]
[342]
[343]
[344]
[345]
[346]
[347]
[348]
[349]
[350]
[351]
[352]
[353]
[354]
[355]
[356]
[357]
[358]
[359]
[360]
[361]
[362]
[363]
[364]
[365]
[366]
[367]
[368]
[369]
[370]
[371]
[372]
[373]
[374]
[375]
[376]
[377]
[378]
[379]
[380]
[381]
[382]
[383]
[384]
[385]
[386]
[387]
[388]
[389]
[390]
[391]
[392]
[393]
[394]
[395]
[396]
[397]
[398]
[399]
[400]
{"$rows_left_out":1695}
{"sheet":"Hoja1","index":2,"n_rows":12,"n_cols":7,"rows_kept":12,"cut":false,"hidden":true,"merged":[]}
[1.1000000000000001]
[1.1000000000000001]
[1.1000000000000001,null,null,null,null,null,11995]
[1.1000000000000001,null,null,null,null,null,11000]
[1.1000000000000001,null,null,null,null,null,{"$f":"G3-G4","v":995}]
[1.1000000000000001,null,null,null,null,null,100]
[1.1000000000000001,null,null,null,null,null,{"$f":"G5*G6","v":99500}]
[1.1000000000000001,null,null,null,null,null,{"$f":"G7/G3","v":8.2951229679032927}]
[1.1000000000000001]
[1.1000000000000001]
[1.1000000000000001]
[{"$f":"SUM(A1:A11)","v":12.099999999999998}]

{"sheet":"raiz","index":3,"n_rows":21,"n_cols":11,"rows_kept":21,"cut":false,"hidden":true,"merged":[]}
[]
[]
[]
[]
[null,null,null,null,7,6,5]
[null,null,null,null,{"$f":"J6*2","v":4},null,null,null,null,2,{"$f":"B14","v":7}]
[null,null,null,null,{"$f":"E5-E6","v":3},{"$f":"F5","v":6},{"$f":"G5","v":5},null,null,{"$f":"J6*2","v":4},7]
[null,null,null,null,3,2,9]
[null,null,null,null,0,3,6]
[]
[]
[]
[null,47]
[null,7]
[null,{"$f":"B14*B13","v":329}]
[]
[]
[]
[]
[null,765]
[null,null,{"$f":"SQRT(B20)","v":27.658633371878661}]