{"text_format":"1","workbook":"xlsx","n_sheets":3,"sheets":["apuntes","ESCRITURA","Hoja1"],"not_rendered":{"charts":0,"images":6,"macros":1,"external_links":0,"defined_names":0,"comments":0,"pivot_tables":0},"unopened":[],"bounds":{"document_bytes":16777216,"sheet_cells":100000,"rows_first":2000,"rows_last":500,"rows_between":2000,"halvings":0,"cell_chars":16384,"cell_head_chars":4096},"cells_cut":0,"cells_raw":0,"read":"whole","date_system":"1900"}

{"sheet":"apuntes","index":0,"n_rows":1337,"n_cols":4,"rows_kept":1337,"cut":false,"hidden":true,"merged":[]}
[null,"bien escrito"]
[1,"Comieron sopa, pescado, huevos y postre.","Comieron sopa pescado huevos y postre.","se separaran por medio de coma. Las palabras de igual clase en la misma oración, menos cuando vayan unidas por las conjunciones y,e,ni,o,u"]
[{"$f":"A2+1","v":2},"He comprado los vasos, cucharas y tenedores.","He comprado los vasos cucharas y tenedores."]
[{"$f":"A3+1","v":3},"Pero aún nos faltan los platos, tazas, pucheros, etc.","Pero aun nos faltan los platos tazas pucheros etc.","antes de etc. Se pondrá coma si va al  final. Caso de ir en medio se pondrá coma antes y después"]
[4,"No quiero esto ni aquello. Quiero el libro o la revista.","No quiero esto ni aquello quiero el libro o la revista.","se separaran por medio de coma. Las palabras de igual clase en la misma oración, menos cuando vayan unidas por las conjunciones y,e,ni,o,u"]
[5,"Los nombres de Juan, Antonio, Luis, Carlos, etc., son corrientes.","Los nombres de Juan Antonio Luis Carlos etc. son corrientes.","antes de etc. Se pondrá coma si va al  final. Caso de ir en medio se pondrá coma antes y después según la coma hace variar algunas veces el significado"]
[6,"Han montado un negocio para la venta de cereales, legumbres, aceites, piensos, jabones, etc.","Han montado un negocio para la venta de cereales legumbres aceites piensos jabones etc."]
[7,"Las lenguas más extendidas son: el inglés, el francés, el español y el alemán.","Las lenguas mas extendidas son el ingles el frances el español y el aleman."]
[8,"Me gustaría vivir en Madrid, Barcelona, Sevilla o Bilbao.","Me gustaria vivir en Madrid Barcelona Sevilla o Bilbao."]
[9,"Pregunté a José María y Luis que preferían y me contestaron: Quedarnos, no marcharnos.","Pregunte a Jose Maria y Luis que preferian y me contestaron Quedarnos no marcharnos.","según la coma hace variar algunas veces el significado    quedarnos, no marcharnos     quedarnos no, marcharnos"]
[10,"Antes de ocupar el cargo has de dominar la ortografía, la mecanografía, la contabilidad, el cálculo, etc.","Antes de ocupar el cargo has de dominar la ortografia la mecanografia la contabilidad el calculo etc."]
[11,"Pereda, Galdós, Benavente, etc., son ejemplos de genio literario español.","Pereda Galdos Benavente etc. son ejemplos de genio literario español."]
[12,"Inglaterra, Estados Unidos, Alemania y Bélgica son grandes productores de carbón.","Inglaterra Estados Unidos Alemania y Belgica son grandes productores de carbon."]
[13,"Don Miguel de Cervantes el escritor de El Quijote, es considerado por muchos el creador de la novela moderna.","Don Miguel de Cervantes el escritor de El Quijote es considerado por muchos el creador de la novela moderna."]
[14,"El alumno, de origen catalán, mostró una interesante visión sobre el nacionalismo.","El alumno de origen catalan mostro una interesante vision sobre el nacionalismo.","En este caso, ya se sabe de qué alumno se está hablando y se explica que es de origen catalán."]
[15,"Todos los trabajadores, excepto los del sindicato, fueron readmitidos.","Todos los trabajadores excepto los del sindicato fueron readmitidos."]
[16,"Todos vinieron a la fiesta: Pedro, Juan, María, César y Cristina.","Todos vinieron a la fiesta Pedro Juan Maria Cesar y Cristina."]
[17,"Metí en la maleta todo lo necesario: neceser, ropa, libros para el viaje, etc.","Meti en la maleta todo lo necesario neceser ropa libros para el viaje etc."]
[18,"Me felicitaron todos mis amigos: Alberto, Gema, Alejandro, María...","Me felicitaron todos mis amigos Alberto Gema Alejandro Maria..."]
[19,"Brindo por ti, por mí; y por todos los que han venido.","Brindo por ti por mi y por todos los que han venido."]
[20,"El ruido era estridente, ensordecedor, y causaba la locura de todo el que lo escuchaba.","El ruido era estridente ensordecedor y causaba la locura de todo el que lo escuchaba."]
[21,"En el armario colocó los pantalones; en el cajón, los calcetines; en los estantes, los zapatos, y los complementos, no los colocó.","En el armario coloco los pantalones en el cajon los calcetines en los estantes los zapatos y los complementos no los coloco."]
[22,"Sebastián, te he dicho que vengas.","Sebastian te he dicho que vengas."]
[23,"Ya tiene usted un aviso, Martínez.","Ya tiene usted un aviso Martínez.","a la persona que nos dirigimos"]
[24,"Sí, señor.","Si señor.","a la persona que nos dirigimos"]
[25,"Belén, Pedro y Juan van a ir a la cena; Cristina y María, no.","Belen Pedro y Juan van a ir a la cena Cristina y Maria no."]
[26,"Los que están aprobados, por ahí.","Los que estan aprobados por ahi.","Se escribe coma cuando el verbo se omite por haber sido mencionado con anterioridad:"]
[27,"Lo arregló un aficionado hace un año. Lo hizo bien, sin embargo; todavía me funciona.","Lo arreglo un aficionado hace un año lo hizo bien sin embargo todavia me funciona."]
[28,"Hoy lloverá; por ello, mejor no salimos de excursión.","Hoy llovera por ello mejor no salimos de excursion."]
[29,"No es mi libro preferido, pero me gusta.","No es mi libro preferido pero me gusta."]
[30,"Ya es tarde; pero me quedo un poco más.","Ya es tarde pero me quedo un poco mas.","No se escribe coma detrás de pero:"]
[31,"Ya es tarde; pero, ya que me lo pides, me quedo un poco más.","Ya es tarde pero ya que me lo pides me quedo un poco mas.","No se escribe coma detrás de pero por significar  ya que"]
[32,"Pero...¿qué me dices?","Pero...¿que me dices?","No se escribe coma detrás de pero:  Sí la puede llevar si va seguido de un inciso:"]
[33,"Pero...¡ no puede ser !","Pero...¡ no puede ser !","Cuando (pero) precede a una construcción interrogativa o exclamativa no se pone coma; se pueden utilizar puntos suspensivos:"]
[34,"Tu trabajo no está completo así que es mejor que lo repitas.","Tu trabajo no esta conpleto asi que es mejor que lo repitas.","Cuando pero precede a una construcción interrogativa o exclamativa no se pone coma; se pueden utilizar puntos suspensivos:"]
[35,"Aunque había estudiado, no aprobé el examen.","Aunque habia estudiado no aprobe el examen.","no se coloca coma detrás de     aunque    ni de     así que:"]
[36,"Le dije que se fuera, y no hizo caso.","Le dije que se fuera y no hizo caso.","º"]
[37,"El descuento será aplicable en cualquier tarifa, excepto en las de grupos.","El descuento sera aplicable en cualquier tarifa excepto en las de grupos.","Si la conjunción (y) posee valor adversativo (equivalente a pero), puede ir precedida de coma:"]
[38,"Estoy disponible todos los días, salvo el último jueves del mes.","Estoy disponible todos los dias salvo el ultimo jueves del mes.","delante de    excepto / salvo / menos  "]
[39,"Puedes hacer con ello lo que quieras, menos regalarlo.","Puedes hacer con ello lo que quieras menos regalarlo.","delante de    excepto / salvo / menos  "]
[40,"Muerto el perro, se acabó la rabia.","Muerto el perro se acabo la rabia.","delante de    excepto / salvo / menos  "]
[41,"Durante aquellos intensos primeros años de casados, el tiempo pasaba lentamente.","Durante aquellos intensos primeros años de casados el tiempo pasaba lentamente."]
[42,"Si no sabes qué hacer, no vengas con nosotros.","Si no sabes que hacer no vengas con nosotros."]
[43,"El novio, los parientes, los invitados, etc., esperaban ya la llegada de la novia.","El novio los parientes los invitados etc. esperaban ya la llegada de la novia.","no vengas con nostros, si no sabes que hacer (invertiendo el sentido)"]
[44,"Mi hermano, como tú sabes, es un magnífico deportista.","Mi hermano como tu sabes es un magnifico deportista."]
[45,"Creía que telefonearía, telegrafiaría o escribiría.","Creia que telefonearia telegrafiaria o escribiria."]
[46,"Sueñas con excursiones, fiestas, novelas, partidos, etc., sin pensar que así no triunfarás en la vida.","Sueñas con excursiones fiestas novelas partidos etc. sin pensar que asi no triunfaras en la vida."]
[47,"La gramática se divide en cuatro partes: prosodia, morfologia, sintaxis y ortografía.","La gramatica se divide en cuatro partes prosodia morfologia sintaxis y ortografia."]
[48,"Para reponerte necesitas comer bien, trabajar poco, dormir mucho y distraerte.","Para reponerte necesitas comer bien trabajar poco dormir mucho y distraerte."]
[49,"Necesitamos adquirir telas, algodón e hilo.","Necesitamos adquirir telas algodon e hilo."]
[50,"No me importa que seas alto, bajo o regular.","No me importa que seas alto bajo o regular."]
[51,"Era joven, educado, correcto, amable y servicial.","Era joven educado correcto amable y servicial."]
[52,"Caja, mobiliario, mercaderias, maquinaría, etc., son cuentas muy usadas en contabilidad.","Caja mobiliario mercaderias maquinaria etc. son cuentas muy usadas en contabilidad."]
[53,"Juan es bueno y Pedro, malo.","Juan es bueno y Pedro malo."]
[54,"Tenemos que prepararnos, debemos aprender, necesitamos trabajar, si queremos progresar en la vida.","Tenemos que prepararnos debemos aprender necesitamos trabajar si queremos progresar en la vida.","se usa coma cuando el verbo esté sobrentendido"]
[55,"Amigo Pedro, debes cuidarte.","Amigo Pedro debes cuidarte.","se utilizará la coma para separar oraciones de ua misma cláusula, aunque vayan unidas por una conjunción"]
[56,"No comprendo, María, como dices eso.","No comprendo Maria como dices eso.","El nombre de la persona a quien nos dirigimos (vocativo) y las palabras que la acompañan, van seguidas de coma cuando están al principio; entre comas si están en medio y precedidas al final"]
[57,"Es necesario que vuelvas pronto, querido Antonio.","Es necesario que vuelvas pronto querido Antonio.","El nombre de la persona a quien nos dirigimos (vocativo) y las palabras que la acompañan, van seguidas de coma cuando están al principio; entre comas si están en medio y precedidas al final"]
[58,"Si no estudias, dijo el padre, no saldrás a pasear.","Si no estudias dijo el padre no saldras a pasear.","El nombre de la persona a quien nos dirigimos (vocativo) y las palabras que la acompañan, van seguidas de coma cuando están al principio; entre comas si están en medio y precedidas al final"]
[59,"Este libro, que es una Geografía, vale veinte pesetas.","Este libro que es una Geografia vale veinte pesetas.","Se pondrá coma antes y después de las oraciones intercaladas, especialmente de las explicativas precedidas del pronombre (que)"]
[60,"El defecto estaba, pues, en el carburador. Necesitamos, por consiguiente, repasarlo antes de partir.","El defecto estaba pues en el carburador  necesitamos por consiguiente repasarlo antes de partir.","Se pondrá coma antes y después de las oraciones intercaladas, especialmente de las explicativas precedidas del pronombre (que)"]
[61,"No comprendí nada, pues estaba demasiado lejos.","No comprendi nada pues estaba demasiado lejos.","Se colocará coma antes y después de (pues) y(también) de finalmente, es decir, de modo que, en efecto, en consecuencia, ya que, sin embargo y  otras expresiones similares."]
[62,"Al regresar del campo, jugaremos en la plaza.","Al regresar del campo jugaremos en la plaza.","Se colocará coma antes y después de (pues) y(también) de finalmente, es decir, de modo que, en efecto, en consecuencia, ya que, sin embargo y otras ...expresiones similares. Cuando (pues) significa (ya que) sólo se pondrá coma delante"]
[63,"Donde menos lo piensas, lo hallarás.","Donde menos lo piensas lo allaras.","Cuando se invierte en el orden regular, se pondrá coma después de la parte adelantada"]
[64,"Dos horas estuvimos explicándoles el mecanismo de la nueva máquina; pero no parecieron comprenderlo del todo.","Dos horas estuvimos explicandoles el mecanismo de la nueva maquina pero no parecieron conprenderlo del todo.","Cuando se invierte en el orden regular, se pondrá coma después de la parte adelantada"]
[65,"Les escribí dos veces, mas no contestaron.","Les escribi dos veces mas no contestaron.","Se pondrá punto y coma antes de las conjunciones adversativas (más, pero, sin embargo, aunque, no obstante, etc., en periodos de alguna extensión. Si estos fuesen cortos bastará coma."]
[66,"Por causas ajenas a nosotros, se ha producido un error lamentable que afecta a alguno de nuestros clientes, entre los que pensamos podría encontrarse usted.","Por causas ajenas a nosotros se a producido un error lamentable que afecta a alguno de nuestros clientes entre los que pensamos podria encontrarse usted.","Se pondrá punto y coma antes de las conjunciones adversativas (más, pero, sin embargo, aunque, no obstante, etc., en periodos de alguna extensión. Si estos fuesen cortos bastará coma."]
[{"$f":"A67+1","v":67},"Algunos de mis clientes habituales se ha interesado por un tipo de productos que ustedes fabrican, y de los cuales yo no tenía referencia hasta el momento. Al parecer, se trata de pinturas de interior, de tipo esmalte y resistentes al agua.","Algunos de mis clientes abituales se a interesado por un tipo de productos que ustedes fabrican y de los cuales yo no tenia referencia hasta el momento al parecer se trata de pinturas de interior de tipo esmalte y resistentes al agua."]
[68,"Necesito que me envíen toda la información posible sobre dichas pinturas: características técnicas, gamas de colores, tamaños de envase y, ¡como no!, lista de precios.","Necesito que me envien toda la informacion posible sobre dichas pinturas caracteristicas tecnicas gamas de colores tamaños de envase y como no lista de precios."]
[69,"Distinguidos señores:","Distinguidos señores"]
[70,"Desde hace más de diez años me dedico a la venta al por menor de artículos de perfumería y droguería, y entre ellos, las pinturas.","Desde hace mas de diez años me dedico a la venta al por menor de articulos de perfumeria y drogueria y entre ellos las pinturas."]
[71,"Creo que podría interesarme la distribución de sus productos en mi establecimiento, siempre que las condiciones que ustedes me ofrezcan sean aceptables.","Creo que podria interesarme la distribucion de sus productos en mi establecimiento siempre que las condiciones que ustedes me ofrezcan sean aceptables."]
[72,"Confío en que me enviarán, lo antes posible, toda la información sobre: Tipos de pinturas. Características y aplicaciones.","Confio en que me enviaran lo antes posible toda la informacion sobre tipos de pinturas caracteristicas y aplicaciones."]
[73,"También necesito conocer otros aspectos relacionados con las compras, como son: Formas y plazos de envío.","Tanbien necesito conocer otros aspectos relacionados con las compras como son formas y plazos de envio."]
[74,"Pronto se construirá la nueva estación, según dicen.","Pronto se construira la nueva estacion segun dicen."]
[75,"Saldré de paseo, cuando acabe este trabajo.","Saldre de paseo cuando acabe este trabajo.","Cuando se invierte en el orden regular, se pondrá coma después de la parte adelantada"]
[76,"Las aleaciones de mercurio con otros metales, llamánse amalgamas.","Las aleaciones de mercurio con otros metales llamanse amalgamas.","Cuando se invierte en el orden regular, se pondrá coma después de la parte adelantada"]
[77,"Por inútil, causó baja en el ejercito.","Por inutil causo baja en el ejercito.","Cuando se invierte en el orden regular, se pondrá coma después de la parte adelantada"]
[78,"Si tuviera más dinero, compraría aquel reloj.","Si tuviera mas dinero compraria aquel reloj.","Cuando se invierte en el orden regular, se pondrá coma después de la parte adelantada"]
[79,"Compraría aquel reloj, si tuviera más dinero.","Compraria aquel reloj si tuviera mas dinero.","Cuando se invierte en el orden regular, se pondrá coma después de la parte adelantada"]
{"$rows_left_out":1258}
{"sheet":"ESCRITURA","index":1,"n_rows":17,"n_cols":25,"rows_kept":17,"cut":false,"hidden":false,"merged":[[4,0,4,22],[0,13,0,17],[0,9,0,12],[0,0,0,8],[3,0,3,22],[2,0,2,23],[0,19,0,21],[24,18,25,19],[24,1,25,2],[19,0,23,21],[12,22,15,22],[18,1,18,3],[17,0,17,22],[9,22,11,22],[9,21,11,21],[9,0,11,20],[12,0,15,20],[5,0,6,20],[7,0,8,20]]}
[null,null,null,null,null,null,null,null,null,"habilitar este contenido",null,null,null,"junio del 2010 por joannostro",null,null,null,null,null,null,null,null,null,{"$f":"RANDBETWEEN(1,152)","v":35}]
[null,null,null,null,null,null,null,null,null,null,null,null,null,null,null,null,null,null,null,null,null,null,null,141]
[{"$f":"VLOOKUP(X2,apuntes!A2:D1148,4,FALSE)","v":"Para introducir una oración explicativa"}]
[{"$f":"VLOOKUP(X2,apuntes!A2:D499,2,FALSE)","v":"Su solicitud, señora Solís, la atenderemos en cuanto nos sea posible."}]
[]
[null,null,null,null,null,null,null,null,null,null,null,null,null,null,null,null,null,null,null,null,null,null,null,0,1]
[]
[{"$f":"VLOOKUP(X2,apuntes!A2:D499,3,FALSE)","v":"Su solicitud señora Solís la atenderemos en cuanto nos sea posible."},null,null,null,null,null,null,null,null,null,null,null,null,null,null,null,null,null,null,null,null,null,null,0,1]
[null,null,null,null,null,null,null,null,null,null,null,null,null,null,null,null,null,null,null,null,null,null,null,{"$f":"D17+G17","v":0}]
[]
[]
[]
[]
[]
[]
[]
[null,null,null,{"$f":"X6","v":0},null,null,{"$f":"X8","v":0},null,null,null,null,{"$f":"IF(X6=0,\"\",D17/X9*100)","v":""},null,null,null,null,null,null,null,null,{"$f":"RANDBETWEEN(1,152)","v":111},118]

{"sheet":"Hoja1","index":2,"n_rows":13,"n_cols":5,"rows_kept":13,"cut":false,"hidden":false,"merged":[[12,4,12,6]]}
[]
[]
[]
[]
[]
[]
[]
[]
[]
[]
[]
[]
[null,null,null,null,"Habilitar este contenido"]