{"text_format":"1","workbook":"xlsx","n_sheets":7,"sheets":["DATOS","datos preguntas","català-caste","caste-català","ESTUDIO","EXEMPLES","l'accent"],"not_rendered":{"charts":0,"images":2,"macros":1,"external_links":0,"defined_names":0,"comments":0,"pivot_tables":0},"unopened":[],"bounds":{"document_bytes":16777216,"sheet_cells":100000,"rows_first":2000,"rows_last":500,"rows_between":2000,"halvings":0,"cell_chars":16384,"cell_head_chars":4096},"cells_cut":0,"cells_raw":0,"read":"whole","date_system":"1900"}

{"sheet":"DATOS","index":0,"n_rows":558,"n_cols":4,"rows_kept":558,"cut":false,"hidden":true,"merged":[]}
[1,"abandonar","abandonar"]
[{"$f":"A1+1","v":2},"ahora ves más que no veías","ara hi veieu més que no hi vèieu","agut tancada"]
[{"$f":"A2+1","v":3},"anteayer","abans-d'ahir"]
[4,"aplaudir","aplaudí"]
[5,"bajaron la pared más de medio metro","van abaixar la paret més de mig metre","agut tancada"]
[6,"cabe recordar","cal recordar"]
[7,"científicamente correcta se cumple","científicament correcta es compleix"]
[8,"comprabais (de comprar)","compràveu"]
[9,"con la consecuencia que hay personas","amb la conseqüència que hi ha persones","greu oberta"]
[10,"corrieron durante muchísimos quilómetros","vam córrer durant moltíssims quilòmetres","greu oberta"]
[11,"de informaciones controvertidas","d'informacions controvertidas"]
[12,"de la suficiente oferta de alimentos","de la suficient oferta d'aliments"]
[13,"de una  otra forma","d'una altra forma"]
[14,"dejar un persona o cosa y no ocuparse más","deixar una persona o cosa i no ocupar-se'n més","agut tancada"]
[15,"dejarse dominarse por un vício","deixar-se dominar per un vici"]
[16,"del célebre intérprete","del cèlebre intèrpret","greu oberta"]
[17,"del décimo aniversario de la nuestra publicación","del desè aniversari de la nostra publicació"]
[18,"desde el punto de vista nutricional","des del punt de vista nutricional"]
[19,"desesperado se abandonó al alcohol","desesperat es va abandonar a l'alcohol"]
[20,"difícil","difícil"]
[21,"el público aplaudió energicámente la actuación","el públic aplaudí enèrgicament l'actuació","greu oberta"]
[22,"el teléfono sonó toda la mañana","el telèfono va sonar tot el matí","greu oberta"]
[23,"en la actualidad","en l'actualidad"]
[24,"en una ciencia desagradable","en una ciència desagradable"]
[25,"es fácil de seguir","és fàcil de seguir"]
[26,"esporádico no tiene ninguna importancia","esporàdic no té cap importància","agut tancada"]
[27,"esta sala tiene una acústica malísima","aquesta sala té una acústica pèssima"]
[28,"estado de ánimo","estat d'ànim"]
[29,"este coche lleno de polvo","aquest cotxe ple de pols"]
[30,"este hecho en sí muy positivo","aquest fet en si molt positiu"]
[31,"extraordinaria","extraordinària"]
[32,"fácil","fàcil"]
[33,"ha desencadenado una série ","ha desencadenat una sèrie","greu oberta"]
[34,"había un rebaño de corderos","hi havia un ramat de bens"]
[35,"hace mucho tiempo que está aquí aparcado","fa  molt de temps que és aquí aparcat"]
[36,"hay un auténtico","hi ha un autèntic","greu oberta"]
[37,"heredó","heretà"]
[38,"interés por la dietética","interès per la dietètica","greu oberta"]
[39,"la alimentación correcta","l'alimentació correcta"]
[40,"la dietètica puede convertirse","la dietètica pot convertir-se","greu oberta"]
[41,"la insistencia de aquella música me ofendía","la insistència d'aquella música m'ofenia","greu oberta"]
[42,"los ciervos","els cérvols","agut tancada"]
[43,"los vecinos han abandonado la casa porqué es muy vieja","els veins han abandonat la casa perquè és molt vella","greu oberta"]
[44,"mi vecino","el meu veí"]
[45,"muchísimos","moltíssims"]
[46,"música","música"]
[47,"nada más dos nietos viven con él a Valencia","només dos néts viuen amb ell a València","greu oberta"]
[48,"nada más lenjos de la realidad","res més lluny de la realitat"]
[49,"nadie","ningú"]
[50,"no es la más ajustada","no és la més ajustada"]
[51,"no se encuentra bien","no es trobe bé","agut tancada"]
[52,"nos explicó una anecdota","ens va explicar una anècdota","greu oberta"]
[53,"para almorzar siempre tomo un café bien espeso","per esmorzar sempre pren un cafè ben espès","greu oberta"]
[54,"pero ninguno no contestaba","però ningú no contestava","greu oberta"]
[55,"pero no causas molestias","però no causen molèsties","greu oberta"]
[56,"podíamos ir a premiar a última hora de la mañana","podríem anar a premià a última hora del matí"]
[57,"podríamos ","podríem"]
[58,"por la mañana","matí "]
[59,"porqué eran más buenos para hacer pan con tomate","perquè eren més bons per fer pa amb tomàquet","greu oberta"]
[60,"porque es muy vieja y puede derrumbarse caerse","perquè és molt vella i pot ensorrar-se","greu oberta"]
[61,"que creen que es muy difícil","que creuen que és molt difícil","agut tancada"]
[62,"que la  mejor norma dietética","que la millor norma dietètica","greu oberta"]
[63,"quiero bajar el cuadro de la pared","vull abaixar el quadre de la paret"]
[64,"quisiéramos","voldríem"]
[65,"quisiéramos que venieran a la celebración","voldríem que vinguéssiu a la celebració"]
[66,"recuerdo bien que entre los bienes que heredó","recordo bé que entre els béns que heretà","agut tancada"]
[{"$f":"A66+1","v":67},"recuerdo que siempre comprábais tomates pequeños","recordo que sempre compràveu tomàquets petits"]
[68,"salir puntual","sortí puntual"]
[69,"se aplica a la persona","s'aplica a la persona"]
[70,"seguir una alimentación correcta","seguir una alimentació correcta"]
[71,"si se dispone","si es disposa"]
[72,"simpático","simpàtic"]
[73,"sino la que siendo","sinó la que essent"]
[74,"sólo (nada más) dos nietos viven con él a Valéncia","només dos néts viuen amb ell a València"]
[75,"su dueño lo ha abandonado","el seu amo l'ha abandonat"]
[76,"tan extraordinaria que no lo creímos","tan extraordinària que no el vàrem creure"]
[77,"tengo un vecino meloman que es muy simpático","tinc un veí melòman que és molt simpàtic","greu oberta"]
[78,"tiene la familia entre París y Venécia","té la família entre París i Venècia","greu oberta"]
[79,"tomate","tomàquet"]
[80,"un desequilibrio dietético","un desequilibri dietètic","greu oberta"]
[81,"vecino","veí"]
[82,"vivía en un abandono total en una casa vieja","vivia en un abandó total en una casa vella"]
[83,"y ahora está en la cama","i ara és al llit","agut tancada"]
[84,"y si se evitan los excesos","i si s'evitan els excessos"]
[85,"y un zúmo de melocotón","i un suc de préssec","agut tancada"]
[86,"ya que una dieta equilibrada","ja que una dieta equilibrada"]
[87,"es fácil de seguir","és fàcil de seguir"]
[88,"si se dispone de la suficiente","si es disposa de la suficient"]
[89,"oferta de alimentos","oferta d'aliments"]
[90,"y si se evitan los excesos","i si s'eviten els excessos"]
[91,"un desequilibrio dietético","un desequilibri dietètic","greu oberta"]
[92,"esporádico no tiene ninguna importancia","esporàdic no té cap importància"]
[93,"desde el punto de vista nutricional","des del punt de vista nutricional"]
[94,"de otra forma","d'una altra forma"]
[95,"la dietética puede convertirse","la dietètica pot convertir-se","greu oberta"]
[96,"en una ciencia desagradable","en una ciència desagradable","greu oberta"]
[97,"cabe recordar que la mejor norma dietética","cal recordar que la millor norma dietètica","greu oberta"]
[98,"no es la más ajustada","no és la més ajustada"]
[99,"la Luisa tiene una vecina suiza","la Lluïsa té una veïna suïssa","agut tancada"]
[100,"las cuestiones que nos formulaba","les qüestions que ens formulava"]
[{"$f":"A100+1","v":101},"heran más ambiguas de lo que parecían","eren més ambigües del que semblava"]
[102,"el pingüino vive en los paises fríos","el pingüi viu als països freds"]
[103,"estos paraguas son verdaderas antiguedades","aquests paraigües son veritables antigutats"]
[104,"los zapatos","les sabates"]
[105,"tienen la lengueta rota","tenen la llengüeta trencada"]
[106,"han recibido la influencia","han rebut l'influència","greu oberta"]
[107,"de las lenguas vecinas","de les llengües veïnes"]
[108,"cocían las ensaimadas en un horno de leña (de cocer)","coïan les ensaïmades en un forn de llenya (coure) "]
[109,"han traducido la vida","han traduït la vida"]
[110,"a las lenguas","a les llengües"]
[111,"el consumo de cocaina y de heroina","el consum de cocaïna i d'heroïna"]
[112,"puede conducir a la delincuencia","pot conduir a la delinqüència","greu oberta"]
[113,"al lado de las ruinas","al costat de les ruïnes"]
[114,"la reina lucía joyas antíguas","la reina lluïa joies antigues"]
[115,"en la plaza hay once casas de pisos","a la plaça hi ha onze cases de pisos"]
[116,"sábado haremos arroz a la cazuela","dissabte farem arròs a la cassola"]
[117,"con guisantes y trozos de conejo","amb pèsols i trossets de conill","greu oberta"]
[118,"el Ignacio piensa pasar las vacaciones en Francia","l'Ignasi pensa passar les vacances a França"]
[119,"son demasiado dulces","són massa dolces","agut tancada"]
[120,"la caza del ciervo fue difícil","la caça del cérvol va ésser difícil","agut tancada"]
{"$rows_left_out":439}
{"sheet":"datos preguntas","index":1,"n_rows":947,"n_cols":3,"rows_kept":947,"cut":false,"hidden":true,"merged":[]}
[1,"abandonar","abandonar"]
[{"$f":"A1+1","v":2},"ahora","ara"]
[{"$f":"A2+1","v":3},"más","més"]
[4,"anteayer","abans-d'ahir"]
[5,"aplaudir","aplaudí"]
[6,"la pared","la paret"]
[7,"científicamente","científicament"]
[8,"se cumple","es compleix"]
[9,"que hay personas","que hi ha persones"]
[10,"de informaciones controvertidas","d'informacions controvertidas"]
[11,"de la suficiente oferta de alimentos","de la suficient oferta d'aliments"]
[12,"de una  otra forma","d'una altra forma"]
[13,"dejar un persona o cosa","deixar una persona o cosa"]
[14,"y no ocuparse más","i no ocupar-se'n més"]
[15,"dejarse dominarse por un vício","deixar-se dominar per un vici"]
[16,"del célebre intérprete","del cèlebre intèrpret"]
[17,"del décimo aniversario","del desè aniversari"]
[18,"de la nuestra publicación","de la nostra publicació"]
[19,"desde el punto de vista nutricional","des del punt de vista nutricional"]
[20,"desesperado","desesperat"]
[21,"desesperado se abandonó al alcohol","desesperat es va abandonar a l'alcohol"]
[22,"difícil","difícil"]
[23,"el público","el públic"]
[24,"aplaudió","aplaudí"]
[25,"energicámente","enèrgicament"]
[26,"la actuación","l'actuació"]
[27,"el teléfono","el telèfono"]
[28,"sonó toda la mañana","va sonar tot el matí"]
[29,"en la actualidad","en l'actualidad"]
[30,"en una ciencia","en una ciència"]
[31,"desagradable"," desagradable"]
[32,"es fácil de seguir","és fàcil de seguir"]
[33,"esporádico","esporàdic"]
[34,"no tiene ninguna importancia","no té cap importància"]
[35,"esta sala","aquesta sala"]
[36,"tiene una acústica malísima","té una acústica pèssima"]
[37,"estado de ánimo","estat d'ànim"]
[38,"este coche lleno de polvo","aquest cotxe ple de pols"]
[39,"este hecho en sí muy positivo","aquest fet en si molt positiu"]
[40,"extraordinaria","extraordinària"]
[41,"fácil","fàcil"]
[42,"ha desencadenado una série ","ha desencadenat una sèrie"]
[43,"había un rebaño de corderos","hi havia un ramat de bens"]
[44,"hace mucho tiempo","fa  molt de temps"]
[45,"que está aquí aparcado","que és aquí aparcat"]
[46,"hay un auténtico","hi ha un autèntic"]
[47,"heredó","heretà"]
[48,"interés por la dietética","interès per la dietètica"]
[49,"la alimentación correcta","l'alimentació correcta"]
[50,"la dietética","la dietètica"]
[51,"puede convertirse","pot convertir-se"]
[52,"la insistencia","la insistència"]
[53,"de aquella música","d'aquella música"]
[54,"me ofendía","m'ofenia"]
[55,"los ciervos","els cérvols"]
[56,"los vecinos","els veins"]
[57,"han abandonado la casa ","han abandonat la casa"]
[58,"porqué es muy vieja","perquè és molt vella"]
[59,"mi vecino","el meu veí"]
[60,"muchísimos","moltíssims"]
[61,"música","música"]
[62,"nada más dos nietos","només dos néts"]
[63,"viven con él a Valencia","viuen amb ell a València"]
[64,"nada más lenjos de la realidad","res més lluny de la realitat"]
[65,"nadie","ningú"]
[66,"no es la más ajustada","no és la més ajustada"]
[{"$f":"A66+1","v":67},"no se encuentra bien","no es trobe bé"]
[68,"nos explicó","ens va explicar"]
[69,"una anecdota","una anècdota"]
[70,"para almorzar","per esmorzar"]
[71,"siempre tomo un café","sempre pren un cafè"]
[72,"bien espeso","ben espès"]
[73,"pero ninguno no contestaba","però ningú no contestava"]
[74,"pero no causas molestias","però no causen molèsties"]
[75,"podíamos ir a premiar","podríem anar a premià"]
[76,"a última hora de la mañana","a última hora del matí"]
[77,"podríamos","podríem"]
[78,"porqué eran más buenos","perquè eren més bons"]
[79,"para hacer pan con tomate","per fer pa amb tomàquet"]
[80,"porque es muy vieja","perquè és molt vella"]
[81,"y puede derrumbarse (caerse)","i pot ensorrar-se"]
[82,"que creen","que creuen"]
[83,"que es muy difícil","que és molt difícil"]
[84,"que la  mejor norma dietética","que la millor norma dietètica"]
[85,"quiero bajar","vull abaixar"]
[86,"el cuadro"," el quadre"]
[87,"de la pared","de la paret"]
[88,"quisiéramos","voldríem"]
[89,"que venieran","que vinguéssiu"]
[90,"a la celebración","a la celebració"]
[91,"recuerdo bien","recordo bé"]
[92,"que entre los bienes","que entre els béns "]
[93,"que heredó","que heretà"]
[94,"recuerdo que siempre","recordo que sempre "]
[95,"comprábais","compràveu"]
[96,"tomates pequeños","tomàquets petits"]
[97,"salir puntual","sortí puntual"]
[98,"se aplica a la persona","s'aplica a la persona"]
[99,"seguir una alimentación correcta","seguir una alimentació correcta"]
[100,"si se dispone","si es disposa"]
[101,"simpático","simpàtic"]
[102,"sólo dos nietos","només dos néts"]
[103,"viven","viuen "]
[104,"con él a Valéncia","amb ell a València"]
[105,"su dueño","el seu amo"]
[106,"lo ha abandonado","l'ha abandonat"]
[107,"tan extraordinaria","tan extraordinària"]
[108,"tengo un vecino","tinc un veí "]
[109,"que es muy simpático","que és molt simpàtic"]
[110,"tiene la familia","té la família"]
[111,"tomate","tomàquet"]
[112,"un desequilibrio dietético","un desequilibri dietètic"]
[113,"vecino","veí"]
[114,"vivía en un abandono","vivia en un abandó"]
[115,"en una casa vieja","en una casa vella"]
[116,"y ahora está en la cama","i ara és al llit"]
[117,"y si se evitan los excesos","i si s'evitan els excessos"]
[118,"y un zúmo","i un suc "]
[119,"de melocotón","de préssec"]
[120,"ya que una dieta equilibrada","ja que una dieta equilibrada"]
{"$rows_left_out":828}
{"sheet":"català-caste","index":2,"n_rows":12,"n_cols":12,"rows_kept":12,"cut":false,"hidden":false,"merged":[[20,0,21,26],[13,2,14,2],[13,3,14,3],[15,5,16,5],[0,3,0,7],[1,1,1,10],[4,2,5,10],[6,2,7,10],[8,2,9,10],[10,1,10,2],[6,0,6,1]]}
[null,null,null,"habilitar este contenido"]
[null,{"$f":"VLOOKUP(L7,'datos preguntas'!A1:C1000,2,FALSE)","v":"de septiembre"}]
[]
[]
[]
[null,null,null,null,null,null,null,null,null,null,null,{"$f":"RANDBETWEEN(1,866)","v":822}]
["celda escritura",null,null,null,null,null,null,null,null,null,null,295]
[]
["volver",null,{"$f":"VLOOKUP(L7,'datos preguntas'!A1:C1000,3,FALSE)","v":"de setembre"}]
[]
[]
[null,null,"respuesta"]

{"sheet":"caste-català","index":3,"n_rows":12,"n_cols":12,"rows_kept":12,"cut":false,"hidden":false,"merged":[[20,0,22,11],[15,5,16,5],[13,3,14,3],[13,2,14,2],[0,3,0,7],[6,2,7,10],[8,2,9,10],[4,2,5,10],[10,1,10,2],[1,1,1,10],[7,0,7,1]]}
[null,null,null,"habilitar este contenido"]
[null,{"$f":"VLOOKUP(L7,'datos preguntas'!A1:C1000,3,FALSE)","v":"l'actuació"}]
[]
[]
[]
[null,null,null,null,null,null,null,null,null,null,null,{"$f":"RANDBETWEEN(1,866)","v":484}]
[null,null,null,null,null,null,null,null,null,null,null,26]
["celda escritura"]
[null,null,{"$f":"VLOOKUP(L7,'datos preguntas'!A1:C1000,2,FALSE)","v":"la actuación"}]
["volver"]
[]
[null,null,"respuesta"]

{"sheet":"ESTUDIO","index":4,"n_rows":18,"n_cols":10,"rows_kept":18,"cut":false,"hidden":false,"merged":[[8,11,9,11],[6,2,7,10],[10,2,11,10],[2,0,2,3],[3,0,3,3],[8,0,9,1],[18,0,21,10],[17,0,17,2],[16,0,16,2],[14,0,14,1],[0,3,0,7],[15,5,16,5],[8,2,9,10]]}
[null,null,null,"habilitar este contenido",null,null,null,null,null,"junio del 2010 por joannostro"]
[]
[]
[]
[null,null,{"$f":"B2","v":0}]
[]
[]
[]
[{"$f":"VLOOKUP(G14,DATOS!A1:D999,4,FALSE)","v":0},null,{"$f":"VLOOKUP(G14,DATOS!A1:D2000,3,FALSE)","v":"fregir"}]
[]
[null,null,{"$f":"VLOOKUP(G14,DATOS!A1:D2002,2,FALSE)","v":"freír"}]
[]
[null,null,null,null,null,null,{"$f":"RANDBETWEEN(1,550)","v":533}]
[null,null,null,null,null,null,204]
[]
[]
["catalán - castellano"]
["castellano - catalán"]

{"sheet":"EXEMPLES","index":5,"n_rows":51,"n_cols":16,"rows_kept":51,"cut":false,"hidden":false,"merged":[]}
["à greu","è  greu","é agut","í  agut","ò greu"," ó agut","agut",null,null,"( ' )","( - )","ss"]
["à"," è (oberta )"," é  (tancada)","í","ò (oberta )","ó ( tancada)","ú","Ç (trancada )","ü","d'aliments","ocupar-se'n","massa","l (germinada)","n palatal","a","e"]
["tomàquet","dietètic","té  bebida","moltíssims","això","córrer","ningú","adreça","qüestions","l'alimentació","posar-los","excessos",null,null,"aquesta","entre"]
["fàcil","desè","més ","científicament","arròs","publicació","ningú","França","Luïsa","l'actuació","tapar-la","assegurem",null,null,"veia","perquè"]
["heretà","molèsties","préssec       melocotón","aquí","arròs","l'actuació","música","dolça","suïssa","d'ànim","ensorrar-se","essent",null,null,"llimona","cèlebre"]
["compràveu","intèrpret","cérvols","veí","ginecòleg","celebració","l'únic","Niça","ambigües","m'ofenia","col-loquin","suïssa",null,null,"temperatura","cotxe"]
["importància","ciència","només","matí","melòman","abandó","música","caça","veïna","d'heroïna","adreçar-se","moltíssims",null,null,"pedra","metge"]
["demà","cèlebre","bé         bien","aplaudí","però","són","públic ","comença","cocaïna","l'alcohol","deixar-se","cassola",null,null,"disfressa"]
["simpàtic","anècdota","és","difícil","quilòmetres","abandó","acústica","plaça","conseqüència","d'una","convertir-se","dissabte",null,null,"posa"]
["esporàdic","enèrgicament","béns (bienes)","vinguéssiu","això","lesió","Llúcia","Pollença","llengüeta","l'ha","recordeu-vos","hortalissa",null,null,"família"]
["fàcilment","interès","cérvol","família",null,"reactivació",null,"adreçar-se","veïnes","d'aliments","fer-la","terrissa",null,null,"Venècia"]
["ànim","pèsima","desaré","Cecília",null,"reanimació",null,"dolçor","d'heroïna","s'hi","tenir-ho","passat",null,null,"ferida"]
["fàcil","insistència","després","jeroglífic",null,"alimentació",null,"avenç","lluïa","l'únic","ennegrir-se","trossos",null,null,"festa"]
["esporàdic","espès","església","difícil",null,"sinó",null,"començat","traduït","l'armari","tirar-hi ","disset",null,null,"dia"]
["vàrem","dietètica","ésser","París",null,"són",null,"llençant","coïan","m'encantan","col-lecció","tinguessis",null,null,"buscava"]
["compràveu","autèntic","néts","difícil",null,"separació",null,"calçat","països","s'aplica","il-lusió","missa",null,null,"encara"]
["extraordinària","cafè","només","voldríem",null,"l'alimentació",null,null,"paraigües","l'alimentació","il-luminació","disfressa",null,null,"cosa"]
["d'ànim","molèsties","també","sortí",null,"l'elaboració",null,null,"llengües","s'evitan","col-locat","tasses",null,null,"correcta"]
["vàlida","perquè","té  (tener)","partícules",null,"recomanació",null,null,"delinqüència","l'organisme","sol-licituds","cossos",null,null,"s'aplica"]
["àcid","conseqüència","procés","decidís",null,"sinó",null,null,"ruïnes","l'experiència","col-laboradors","possibilitat",null,null,"portava"]
["elàstics","influència","després","podríem",null,"col-lecció",null,null,"pingüi","d'aquella","pel-lícula","ésser",null,null,"s'eliminan"]
["s'està","ciència","també","així",null,"il-lusió",null,null,"freqüents","d'en","novel-les","grosses",null,null,"cal-ligrafia"]
["ancià","València","ésser","centímetres",null,"muntanyós",null,null,"produïdes","d'agost","intel-ligent","assolellats"]
[null,"sèrie","aniré","centímetres",null,"reunió",null,null,"llengüeta","l'objecte","abstenir-se","cossos"]
[null,"telèfono","beuré","família",null,"l'absorció",null,null,"veïnes","s'aconsegueix","privar-se","trossejar"]
[null,"Venècia",null,"jardí",null,"abstenció",null,null,"coïan","l'hivern","instal-lar-se","massa"]
[null,"delinqüència",null,"mínima",null,"raó",null,null,"ensaïmades","d'estiu","accidentar-se","participessin"]
[null,"diferència",null,"física",null,"actuació",null,null,"traduït","s'aplica","escalfar-nos","ésser"]
[null,"fèrtils",null,"Lluís",null,"excitació",null,null,"cocaïna","l'hivern","cal-ligrafia","essencial"]
[null,"l'experiència",null,"pel-lícula",null,"camió",null,null,"d'heroïna","l'únic"]
[null,"Mercè",null,"policíaques",null,"aixó",null,null,null,"l'únic"]
[null,"perquè",null,null,null,"acció",null,null,null,"l'aixeta"]
[null,"pèsols",null,null,null,null,null,null,null,"l'Angels"]
[null,"diferència",null,null,null,null,null,null,null,"m'ha"]
[null,"tècnica",null,null,null,null,null,null,null,"s'han"]
[null,"perquè",null,null,null,null,null,null,null,"s'ha"]
[null,"cafè",null,null,null,null,null,null,null,"d'avui"]
[null,"acadèmia",null,null,null,null,null,null,null,"d'aquelles"]
[null,null,null,null,null,null,null,null,null,"l'all"]
[null,null,null,null,null,null,null,null,null,"s'enfarinen"]
[null,null,null,null,null,null,null,null,null,"l'estiu"]
[null,null,null,null,null,null,null,null,null,"l'objectiu"]
[null,null,null,null,null,null,null,null,null,"l'alvocat"]
[null,null,null,null,null,null,null,null,null,"s'oxida"]
[null,null,null,null,null,null,null,null,null,"l'ombra"]
[null,null,null,null,null,null,null,null,null,"d'aquest"]
[null,null,null,null,null,null,null,null,null,"s'està"]
[null,null,null,null,null,null,null,null,null,"l'arxiu"]
[null,null,null,null,null,null,null,null,null,"d'heroïna"]
[null,null,null,null,null,null,null,null,null,"l'any"]
[null,null,null,null,null,null,null,null,null,"l'accident"]

{"sheet":"l'accent","index":6,"n_rows":18,"n_cols":6,"rows_kept":18,"cut":false,"hidden":false,"merged":[[9,0,9,11],[11,0,11,11],[12,0,12,11],[2,0,2,11],[3,0,3,11],[4,0,4,11],[6,0,6,11],[7,0,7,11],[8,0,8,11]]}
[]
[]
["El català té cinc vocals    a e i o u           D'aquestes vocals, la (e) i la (o) tenen dues pronunciacions:  oberte i tancada"]
["És oberta la e de pera, selva, gerra, bè (el petit de l'ovella)        És tancada la e de seva, pell, cauré, bé (adverbi)"]
["És oberta la o de gol, col, sòl, asixò          És tancada la o de por, bot, caixó, saló"]
[]
["Accents  agut ( ´ )      i         greu  ( ` )  Quan cal acentuar-les gràficament"]
["La (a) duen sempre l'accent greu  ( ` )      capità,  hàbil,  ánima"]
["La ( i )   i     la   ( u ) duen sempre l'accente agut ( ´ )  camí, índex, útil, comú"]
["La ( e ) i la ( o ) duen l'accent greu o l'agut segons que siguin obertes o tancades"]
[]
["En terminacions verbals:"]
["La (e), sempre l'accent agut ( ´ ): donaré, seré, digué, prenguéren, visquéren, sabés, coneguésem, veiéssim."]
[]
[]
[]
[]
[null,null,null,null,null,"volver"]