{"text_format":"1","workbook":"xlsx","n_sheets":7,"sheets":["DATOS CARTA00","lec.2","ESCRITURA","PULSACIONES","lec.03","lec.04","lec.05"],"not_rendered":{"charts":0,"images":2,"macros":1,"external_links":0,"defined_names":0,"comments":0,"pivot_tables":0},"unopened":[],"bounds":{"document_bytes":16777216,"sheet_cells":100000,"rows_first":2000,"rows_last":500,"rows_between":2000,"halvings":0,"cell_chars":16384,"cell_head_chars":4096},"cells_cut":0,"cells_raw":0,"read":"whole","date_system":"1900"}

{"sheet":"DATOS CARTA00","index":0,"n_rows":58,"n_cols":3,"rows_kept":58,"cut":false,"hidden":true,"merged":[]}
[1,"las faldas dada sala jaka kafka kasa kaka faja jalas laka kasada fajadaala",1]
[2,"sal faja añada sala salsa sal salada falsas alfalfa saldada fallas alada las",1]
[3,"faldas dada sala jaka kafka kasa kaka las faja jalas laka kasada fajada sal",1]
[4,"faja añada sala salsa salada faldas falsas alfalfa saldada fallas las faldas",1]
[5,"dada sala jaka kafka kasa kaka sal faja añada sal salsa salada falsas",1]
[6,"alfalfa salada fallas saldada alada las faldas dada sala jaka kafka kasa",1]
[7,"kaka faja jalas laka kasada fajada sal faja añada sala salsa salada falsas",1]
[8,"alfalfa saldada sala fallas aladas",1]
[9,"STOP",1]
[10]
[11]
[12]
[13]
[14]
[15]
[16]
[17]
[18]
[19]
[20]
[21]
[22]
[23]
[24]
[25]
[26]
[27]
[28]
[29]
[30]
[31]
[32]
[33]
[34]
[35]
[36]
[37]
[38]
[39]
[40]
[41]
[42]
[43]
[44]
[45]
[46]
[47]
[48]
[49]
[50]
[51]
[52]
[53]
[54]
[55]
[56]
[57]
[58]

{"sheet":"lec.2","index":1,"n_rows":15,"n_cols":3,"rows_kept":15,"cut":false,"hidden":true,"merged":[]}
[1,"hasada lagaña halagas gafas agasajas agallas hagas hala halla gala has",2]
[2,"alga alhajas llagas hallada kagas hadas gasas gala has alga alhaja llagas",2]
[3,"halladas kagas hadas gasas hasada lagaña halagas gafas agasajas agallas",2]
[4,"hagas hala halla hada lasaña laña gasa daga gasa gaja gada gasas hadas",2]
[5,"gasas hadas gas saga gala laga gala hadas lasaña gasa aga haga hadas",2]
[6,"gasas hadas laña hadas gasas hadas galas halladas lagañas gasa saga",2]
[7,"lasaña ñasala fajas jafas hada lagaña halagas gafas agasajas agallas halla",2]
[8,"hada lasaña laña gasa daga gas hadas laña gasa gas",2]
[9,"STOP",2]
[10]
[11]
[12]
[13]
[14]
[15]

{"sheet":"ESCRITURA","index":2,"n_rows":15,"n_cols":13,"rows_kept":15,"cut":false,"hidden":false,"merged":[[1,8,2,8],[0,10,4,10],[0,4,0,6],[3,0,3,8],[4,0,4,8],[0,9,4,9],[5,4,5,5],[13,0,13,9],[14,0,14,9],[12,0,12,9],[11,0,11,9],[10,0,10,10]]}
[null,null,null,null,"habilitar este contenido",null,null,null,null,null,null,1,{"$f":"NOW()","v":41715.697876273145}]
[{"$f":"A3-M2","v":"00:00:00.050"},null,null,null,null,"lección",{"$f":"L11","v":1},"nombre",null,null,null,null,41715.697875694445]
[{"$f":"NOW()","v":41715.697876273145},{"$f":"M1-M6","v":"00:00:20.670"},null,null,"pulsaciones",{"$f":"M5","v":""},"minuto","PAPA",null,null,null,1,{"$f":"(HOUR(L5)*3600)+(MINUTE(L5)*60+SECOND(L5))","v":0}]
[{"$f":"A11","v":"las faldas dada sala jaka kafka kasa kaka faja jalas laka kasada fajadaala"},null,null,null,null,null,null,null,null,null,null,550,{"$f":"IF(M3=0,\"\",L4/M3*60)","v":""}]
[null,null,null,null,null,null,null,null,null,null,null,{"$f":"A2","v":"00:00:00.050"},{"$f":"IF(A4=\"STOP\",M4,\"\")","v":""}]
[null,null,null,null,{"$f":"A2","v":"00:00:00.050"},null,null,null,null,null,null,{"$f":"TODAY()","v":"2014-03-17"},41715.697637037039]
[]
[]
[]
[]
[{"$f":"VLOOKUP(L1,'DATOS CARTA00'!A1:B50,2,FALSE)","v":"las faldas dada sala jaka kafka kasa kaka faja jalas laka kasada fajadaala"},null,null,null,null,null,null,null,null,null,null,{"$f":"VLOOKUP(L1,'DATOS CARTA00'!A1:C23,3,FALSE)","v":1}]
[{"$f":"VLOOKUP(L1,lec.2!A1:B17,2,FALSE)","v":"hasada lagaña halagas gafas agasajas agallas hagas hala halla gala has"},null,null,null,null,null,null,null,null,null,null,{"$f":"VLOOKUP(L1,lec.2!A1:C15,3,FALSE)","v":2}]
[{"$f":"VLOOKUP(L1,lec.03!A1:B18,2,FALSE)","v":"leña fea lisa deidad gelida seda jefe fila sida dias fije siglas del"},null,null,null,null,null,null,null,null,null,null,{"$f":"VLOOKUP(L1,lec.03!A1:C24,3,FALSE)","v":3}]
[{"$f":"VLOOKUP(L1,lec.04!A1:B10,2,FALSE)","v":"ñu regulares lugar usarse seguridad asegurar sugiere fuera guardar sufre"},null,null,null,null,null,null,null,null,null,null,{"$f":"VLOOKUP(L1,lec.04!A1:C17,3,FALSE)","v":4}]
[{"$f":"VLOOKUP(L1,lec.05!A1:B100,2,FALSE)","v":"ñoño ñoña españa que dedo porque pequeños quiero aquellos por pero paso"},null,null,null,null,null,null,null,null,null,null,{"$f":"VLOOKUP(L1,lec.05!A1:C24,3,FALSE)","v":5}]

{"sheet":"PULSACIONES","index":3,"n_rows":648,"n_cols":12,"rows_kept":648,"cut":false,"hidden":false,"merged":[[0,4,0,5]]}
[{"$f":"VLOOKUP(G1,B3:E464,4,FALSE)","v":"PAPA"},null,"tiempo","lección","PULSACIONES MINUTO",null,{"$f":"MAX((B21:B648))","v":253.84615384615384},{"$f":"VLOOKUP(G2,B3:E472,4,FALSE)","v":"PAPA"},"años","meses","días",{"$f":"A648","v":"2011-01-29"}]
[{"$f":"TODAY()","v":"2014-03-17"},null,null,null,"nombre","volver",{"$f":"LARGE(B21:B648,2)","v":253.84615384615384},{"$f":"IF(G2,A648,)","v":"2011-01-29"},{"$f":"DATEDIF(L1,A608,\"y\")","v":0},{"$f":"DATEDIF(L1,A608,\"ym\")","v":0},{"$f":"DATEDIF(L1,A608,\"d\")","v":7}]
["2013-04-03",237.41007194244602,"00:02:21.210",5,"PAPA"]
["2013-03-29",232.3943661971831,"00:02:23.780",2,"PAPA"]
["2013-03-29",202.45398773006136,"00:02:44.690",1,"PAPA"]
["2013-03-18",221.47651006711408,"00:02:30.930",5,"PAPA"]
["2013-03-18",200,"00:02:48.640",4,"PAPA"]
["2013-03-18",230.76923076923077,"00:02:26.380",3,"PAPA"]
["2013-03-18",207.54716981132077,"00:02:41.180",2,"PAPA"]
["2013-03-18",198.79518072289156,"00:02:48.110",1,"PAPA"]
["2013-03-14",229.16666666666669,"00:02:25.440",5,"PAPA"]
["2013-03-14",201.21951219512195,"00:02:45.560",4,"PAPA"]
["2013-03-14",229.16666666666669,"00:02:26.330",3,"PAPA"]
["2013-03-14",217.10526315789474,"00:02:34.610",2,"PAPA"]
["2013-03-14",232.3943661971831,"00:02:23.440",1,"PAPA"]
["2013-03-13",226.02739726027397,"00:02:27.940",5,"PAPA"]
["2013-03-13",207.54716981132077,"00:02:42.090",4,"PAPA"]
["2013-03-13",244.44444444444446,"00:02:17",3,"PAPA"]
["2013-03-13",226.02739726027397,"00:02:27.810",2,"PAPA"]
["2013-03-13",222.97297297297297,"00:02:31.640",1,"PAPA"]
["2012-03-13",210.19108280254778,"00:02:38.950",5,"PAPA"]
["2012-03-13",211.53846153846155,"00:02:38.590",4,"PAPA"]
["2012-03-13",230.76923076923077,"00:02:24.820",3,"PAPA"]
["2012-03-13",211.53846153846155,"00:02:38.480",2,"PAPA"]
["2012-03-13",220,"00:02:31.590",1,"PAPA"]
["2012-03-13",242.64705882352939,"00:02:19.140",5,"NUEVO"]
["2012-03-13",234.04255319148936,"00:02:23.110",4,"NUEVO"]
["2012-03-13",230.76923076923077,"00:02:24.690",3,"NUEVO"]
["2012-03-13",215.68627450980392,"00:02:35.570",2,"NUEVO"]
["2012-03-13",218.54304635761588,"00:02:35.090",1,"NUEVO"]
["2012-03-13",244.44444444444446,"00:02:18.550",5,"PAPA"]
["2012-03-13",215.68627450980392,"00:02:34.570",4,"PAPA"]
["2012-03-13",229.16666666666669,"00:02:25.530",3,"PAPA"]
["2012-03-13",224.48979591836735,"00:02:29.750",2,"PAPA"]
["2012-03-13",214.28571428571431,"00:02:36.670",1,"PAPA"]
["2012-03-12",221.47651006711408,"00:02:31.220",5,"PAPA"]
["2012-03-12",220,"00:02:32.350",4,"PAPA"]
["2012-03-12",214.28571428571431,"00:02:35.770",3,"PAPA"]
["2012-03-12",222.97297297297297,"00:02:29.150",2,"PAPA"]
["2012-03-12",204.96894409937889,"00:02:43.800",1,"PAPA"]
["2012-03-12",224.48979591836735,"00:02:28.700",5,"PAPA"]
["2012-03-12",214.28571428571431,"00:02:37.480",4,"PAPA"]
["2012-03-12",227.58620689655172,"00:02:27.220",3,"PAPA"]
["2012-03-12",217.10526315789474,"00:02:34.370",2,"PAPA"]
["2012-03-12",218.54304635761588,"00:02:33.040",1,"PAPA"]
["2012-03-11",111.11111111111111,"00:05:00.560",1,"Nena"]
["2012-03-11",204.96894409937889,"00:02:42.930",1,"PAPA"]
["2012-03-11",235.71428571428569,"00:02:21.990",5,"PAPA"]
["2012-03-11",214.28571428571431,"00:02:37",4,"PAPA"]
["2012-03-11",224.48979591836735,"00:02:30.300",3,"PAPA"]
["2012-03-11",230.76923076923077,"00:02:25.860",2,"PAPA"]
["2012-03-11",222.97297297297297,"00:02:31.970",1,"PAPA"]
["2012-03-11",230.76923076923077,"00:02:26.410",3,"PAPA"]
["2012-03-11",221.47651006711408,"00:02:30.830",3,"PAPA"]
["2012-03-11",220,"00:02:34.050",1,"PAPA"]
["2012-03-10",224.48979591836735,"00:02:28.890",3,"PAPA"]
["2012-03-10",210.19108280254778,"00:02:39.100",2,"PAPA"]
["2012-03-10",227.58620689655172,"00:02:27.460",1,"PAPA"]
["2012-03-10",226.02739726027397,"00:02:27.610",5,"PAPA"]
["2012-03-10",215.68627450980392,"00:02:35.420",4,"PAPA"]
["2012-03-10",226.02739726027397,"00:02:28.580",3,"PAPA"]
["2012-03-10",220,"00:02:31.550",2,"PAPA"]
["2012-03-10",202.45398773006136,"00:02:44.920",1,"PAPA"]
["2012-03-09",222.97297297297297,"00:02:29.840",5,"PAPA"]
["2012-03-09",212.90322580645162,"00:02:37.450",4,"PAPA"]
["2012-03-09",224.48979591836735,"00:02:29.250",3,"PAPA"]
["2012-03-09",210.19108280254778,"00:02:40.030",2,"PAPA"]
["2012-03-09",192.98245614035088,"00:02:52.550",1,"PAPA"]
["2012-03-08",215.68627450980392,"00:02:35.110",5,"PAPA"]
["2012-03-08",202.45398773006136,"00:02:45.390",4,"PAPA"]
["2012-03-08",224.48979591836735,"00:02:28.660",3,"PAPA"]
["2012-03-08",210.19108280254778,"00:02:40.090",2,"PAPA"]
["2012-03-08",196.42857142857142,"00:02:50.300",1,"PAPA"]
["2012-03-06",215.68627450980392,"00:02:38.230",5,"PAPA"]
["2012-03-06",217.10526315789474,"00:02:33.810",4,"PAPA"]
["2012-03-06",235.71428571428569,"00:02:21.980",3,"PAPA"]
["2012-03-06",212.90322580645162,"00:02:37.710",2,"PAPA"]
["2012-03-06",203.7037037037037,"00:02:44.560",1,"PAPA"]
["2012-03-06",229.16666666666669,"00:02:25.170",5,"PAPA"]
["2012-03-06",211.53846153846155,"00:02:37.440",4,"PAPA"]
["2012-03-06",207.54716981132077,"00:02:40.680",3,"PAPA"]
["2012-03-06",194.11764705882354,"00:02:53.010",2,"PAPA"]
["2012-03-06",204.96894409937889,"00:02:43.420",4,"PAPA"]
["2012-03-05",226.02739726027397,"00:02:28.040",5,"PAPA"]
["2012-03-05",212.90322580645162,"00:02:37.700",4,"PAPA"]
["2012-03-05",218.54304635761588,"00:02:32.390",3,"PAPA"]
["2012-03-05",208.86075949367088,"00:02:40.090",2,"PAPA"]
["2012-03-05",214.28571428571431,"00:02:35.080",1,"PAPA"]
["2012-02-28",229.16666666666669,"00:02:26.770",5,"PAPA"]
["2012-02-28",221.47651006711408,"00:02:31.670",4,"PAPA"]
["2012-02-28",232.3943661971831,"00:02:23.560",3,"PAPA"]
["2012-02-28",220,"00:02:31.910",2,"PAPA"]
["2012-02-28",217.10526315789474,"00:02:33.830",1,"PAPA"]
["2012-02-27",232.3943661971831,"00:02:25",5,"PAPA"]
["2012-02-27",235.71428571428569,"00:02:22.080",4,"PAPA"]
["2012-02-27",224.48979591836735,"00:02:29.190",3,"PAPA"]
["2012-02-27",210.19108280254778,"00:02:38.480",2,"PAPA"]
["2012-02-27",214.28571428571431,"00:02:35.660",1,"PAPA"]
["2012-02-26",221.47651006711408,"00:02:31.270",5,"PAPA"]
["2012-02-26",218.54304635761588,"00:02:32.670",4,"PAPA"]
["2012-02-26",227.58620689655172,"00:02:27.360",3,"PAPA"]
["2012-02-26",222.97297297297297,"00:02:31.170",2,"PAPA"]
["2012-02-26",218.54304635761588,"00:02:35.470",1,"PAPA"]
["2012-02-06",224.48979591836735,"00:02:30.220",5,"PAPA"]
["2012-02-06",227.58620689655172,"00:02:28.870",4,"PAPA"]
["2012-02-06",232.3943661971831,"00:02:25.500",3,"PAPA"]
["2012-02-06",229.16666666666669,"00:02:25.920",2,"PAPA"]
["2012-02-06",192.98245614035088,"00:02:53.610",1,"PAPA"]
["2012-02-01",232.3943661971831,"00:02:23.430",5,"PAPA"]
["2012-02-01",221.47651006711408,"00:02:31.050",4,"PAPA"]
["2012-02-01",217.10526315789474,"00:02:33.930",3,"PAPA"]
["2012-02-01",222.97297297297297,"00:02:29.550",2,"PAPA"]
["2012-02-01",221.47651006711408,"00:02:30.470",1,"PAPA"]
["2012-01-30",217.10526315789474,"00:02:34.910",5,"PAPA"]
["2012-01-30",214.28571428571431,"00:02:35.640",4,"PAPA"]
["2012-01-30",214.28571428571431,"00:02:37.890",3,"PAPA"]
["2012-01-30",237.41007194244602,"00:02:21.200",2,"PAPA"]
["2012-01-30",208.86075949367088,"00:02:39.910",1,"PAPA"]
["2012-01-25",230.76923076923077,"00:02:26.230",5,"PAPA"]
["2012-01-25",253.84615384615384,"00:02:11.480",4,"PAPA"]
["2012-01-25",240.87591240875912,"00:02:21.580",3,"PAPA"]
["2012-01-25",222.97297297297297,"00:02:29.480",2,"PAPA"]
["2012-01-25",202.45398773006136,"00:02:44.780",1,"PAPA"]
["2012-01-24",204.96894409937889,"00:02:42.630",5,"PAPA"]
["2012-01-24",237.41007194244602,"00:02:20.960",4,"PAPA"]
["2012-01-24",208.86075949367088,"00:02:39.870",3,"PAPA"]
["2012-01-24",210.19108280254778,"00:02:38.580",2,"PAPA"]
["2012-01-24",229.16666666666669,"00:02:26.590",1,"PAPA"]
["2012-01-23",240.87591240875912,"00:02:19.520",5,"PAPA"]
["2012-01-23",227.58620689655172,"00:02:26.590",4,"PAPA"]
["2012-01-23",242.64705882352939,"00:02:18.210",3,"PAPA"]
["2012-01-23",226.02739726027397,"00:02:28.140",2,"PAPA"]
["2012-01-23",203.7037037037037,"00:02:45.640",1,"PAPA"]
["2012-01-22",221.47651006711408,"00:02:31.200",5,"PAPA"]
["2012-01-22",235.71428571428569,"00:02:22.340",4,"PAPA"]
["2012-01-22",226.02739726027397,"00:02:28.550",3,"PAPA"]
["2012-01-22",224.48979591836735,"00:02:29.360",2,"PAPA"]
["2012-01-22",204.96894409937889,"00:02:44.490",1,"PAPA"]
["2012-01-20",237.41007194244602,"00:02:21.270",5,"PAPA"]
["2012-01-20",248.12030075187968,"00:02:15.130",4,"PAPA"]
["2012-01-20",253.84615384615384,"00:02:12.310",3,"PAPA"]
["2012-01-20",239.13043478260869,"00:02:19.540",2,"PAPA"]
["2012-01-20",218.54304635761588,"00:02:32.330",1,"PAPA"]
["2012-01-20",212.90322580645162,"00:02:37.660",5,"PAPA"]
["2012-01-20",237.41007194244602,"00:02:22.270",4,"PAPA"]
["2012-01-20",230.76923076923077,"00:02:25.750",3,"PAPA"]
["2012-01-20",215.68627450980392,"00:02:37.270",2,"PAPA"]
["2012-01-20",204.96894409937889,"00:02:44.090",1,"PAPA"]
["2012-01-15",217.10526315789474,"00:02:34.140",5,"PAPA"]
["2012-01-15",242.64705882352939,"00:02:17.840",4,"PAPA"]
["2012-01-15",239.13043478260869,"00:02:19.190",3,"PAPA"]
["2012-01-15",237.41007194244602,"00:02:20.490",2,"PAPA"]
["2012-01-15",227.58620689655172,"00:02:27.740",1,"PAPA"]
["2012-01-14",212.90322580645162,"00:02:37.220",5,"PAPA"]
["2012-01-14",229.16666666666669,"00:02:26.470",4,"PAPA"]
["2012-01-14",218.54304635761588,"00:02:33.280",3,"PAPA"]
["2012-01-14",204.96894409937889,"00:02:44.550",2,"PAPA"]
["2012-01-14",208.86075949367088,"00:02:41.920",1,"PAPA"]
["2012-01-13",221.47651006711408,"00:02:30.330",5,"PAPA"]
["2012-01-13",235.71428571428569,"00:02:22.670",4,"PAPA"]
["2012-01-13",218.54304635761588,"00:02:33.180",3,"PAPA"]
["2012-01-13",212.90322580645162,"00:02:38.080",2,"PAPA"]
["2012-01-13",180.32786885245901,"00:03:05.630",1,"PAPA"]
["2012-01-11",212.90322580645162,"00:02:38.930",2,"PAPA"]
["2012-01-11",222.97297297297297,"00:02:30.040",1,"PAPA"]
["2012-01-08",207.54716981132077,"00:02:41.360",5,"PAPA"]
["2012-01-08",240.87591240875912,"00:02:18.560",4,"PAPA"]
["2012-01-08",224.48979591836735,"00:02:28.530",3,"PAPA"]
["2012-01-08",220,"00:02:31.470",2,"PAPA"]
["2012-01-08",214.28571428571431,"00:02:35.650",1,"PAPA"]
["2012-01-06",214.28571428571431,"00:02:35.620",5,"PAPA"]
["2012-01-06",218.54304635761588,"00:02:33.170",4,"PAPA"]
["2012-01-06",214.28571428571431,"00:02:36.080",3,"PAPA"]
["2012-01-06",207.54716981132077,"00:02:40.800",2,"PAPA"]
["2012-01-06",197.60479041916167,"00:02:48.390",1,"PAPA"]
["2012-01-04",232.3943661971831,"00:02:26.070",5,"PAPA"]
["2012-01-04",214.28571428571431,"00:02:35.690",4,"PAPA"]
["2012-01-04",203.7037037037037,"00:02:45.460",3,"PAPA"]
["2012-01-04",197.60479041916167,"00:02:49.320",2,"PAPA"]
["2012-01-04",191.86046511627907,"00:02:54.140",1,"PAPA"]
["2012-01-02",210.19108280254778,"00:02:39.360",5,"PAPA"]
["2012-01-02",222.97297297297297,"00:02:29.290",4,"PAPA"]
["2012-01-02",229.16666666666669,"00:02:25.770",3,"PAPA"]
["2012-01-02",204.96894409937889,"00:02:43.600",2,"PAPA"]
["2012-01-02",208.86075949367088,"00:02:40.210",1,"PAPA"]
["2012-01-02",234.04255319148936,"00:02:22.830",5,"PAPA"]
["2012-01-02",221.47651006711408,"00:02:30.990",4,"PAPA"]
["2012-01-02",224.48979591836735,"00:02:29.680",3,"PAPA"]
["2012-01-02",211.53846153846155,"00:02:38.440",2,"PAPA"]
["2012-01-02",218.54304635761588,"00:02:33.350",1,"PAPA"]
["2012-01-01",227.58620689655172,"00:02:26.530",5,"PAPA"]
["2012-01-01",227.58620689655172,"00:02:27.120",4,"PAPA"]
["2012-01-01",244.44444444444446,"00:02:17.450",3,"PAPA"]
["2012-01-01",222.97297297297297,"00:02:30.500",2,"PAPA"]
["2012-01-01",214.28571428571431,"00:02:35.680",1,"PAPA"]
["2012-01-01",214.28571428571431,"00:02:35.980",5,"PAPA"]
["2012-01-01",224.48979591836735,"00:02:29.010",4,"PAPA"]
["2012-01-01",220,"00:02:32.240",3,"PAPA"]
["2012-01-01",206.25,"00:02:42.310",2,"PAPA"]
["2012-01-01",181.31868131868131,"00:03:04.250",1,"PAPA"]
{"$rows_left_out":449}
{"sheet":"lec.03","index":4,"n_rows":24,"n_cols":3,"rows_kept":24,"cut":false,"hidden":true,"merged":[]}
[1,"leña fea lisa deidad gelida seda jefe fila sida dias fije siglas del",3]
[2,"desde les se lea esa ese he ellas ideas sea diseñe llega si la le el es fe",3]
[3,"la le el es fe la le el es dieses fieles dieses fieles dieses fieles hiedes",3]
[4,"fijese hiedes fijese hiedes fijese leña fea lisa deidad gelida jefe fila",3]
[5,"del desde les se lea esa ese ellas ideas si diseses fieles dieses fieles",3]
[6,"dieses dia liase desele liase sida dias fije siglas sea diseñe llega gases",3]
[7,"silla sella lagaña alaska iglesias flageladas hallase seda si ese jefe",3]
[8,"ideas sida dias fijes deidad del desde",3]
[9,"STOP",3]
[10]
[11]
[12]
[13]
[14]
[15]
[16]
[17]
[18]
[19]
[20]
[21]
[22]
[23]
[24]

{"sheet":"lec.04","index":5,"n_rows":26,"n_cols":3,"rows_kept":26,"cut":false,"hidden":true,"merged":[]}
[1,"ñu regulares lugar usarse seguridad asegurar sugiere fuera guardar sufre",4]
[2,"usara lugar figura usarla igual sigue su lugar duda fue use usada aliñar",4]
[3,"leer serie realidad darse darse era red leer usara lugar serie ir sufre",4]
[4,"realidad darse fijarse guardar agregar era idear darles reglas heredar",4]
[5,"heredarla agregarle figura agregarla usarla llegar regulares lugar usarse",4]
[6,"seguridad asegurar sugiere fuera guardar sufre usara lugar figura usarla",4]
[7,"igual sigue su lugar duda fue use usada realidad darse fijarse guardar",4]
[8,"agregar era idear darles reglas heredar uiea frase",4]
[9,"STOP",4]
[10]
[11]
[12]
[13]
[14]
[15]
[16]
[17]
[18]
[19]
[20]
[21]
[22]
[23]
[24]
[25]
[26]

{"sheet":"lec.05","index":6,"n_rows":45,"n_cols":3,"rows_kept":45,"cut":false,"hidden":true,"merged":[]}
[1,"ñoño ñoña españa que dedo porque pequeños quiero aquellos por pero paso",5]
[2,"propios apropiados esperado operador pasarlo podido propiedad perforadas",5]
[3,"pode preferido poseer puro pero paso propios apropiado esperado operador",5]
[4,"pasarlo podido propiedad perforadas pode propiedades pequeño poderles",5]
[5,"porque pop preferido poseer puro porque pasa por españa que dedo porque",5]
[6,"pequeños quiero aquellos por pero paso propios apropiado esperado operador",5]
[7,"pasarlo apropiado para querer ha sido operado del ojo porque es parado del",5]
[8,"poder que quiere prefiere dar que apropiarse del",5]
[9,"STOP",5]
[10]
[11]
[12]
[13]
[14]
[15]
[16]
[17]
[18]
[19]
[20]
[21]
[22]
[23]
[24]
[25]
[26]
[27]
[28]
[29]
[30]
[31]
[32]
[33]
[34]
[35]
[36]
[37]
[38]
[39]
[40]
[41]
[42]
[43]
[44]
[45]