{"text_format":"1","workbook":"xlsx","n_sheets":7,"sheets":["DATOS CARTA00","lec.2","ESCRITURA","PULSACIONES","lec.03","lec.04","lec.05"],"not_rendered":{"charts":0,"images":2,"macros":1,"external_links":0,"defined_names":0,"comments":0,"pivot_tables":0},"unopened":[],"bounds":{"document_bytes":16777216,"sheet_cells":100000,"rows_first":2000,"rows_last":500,"rows_between":2000,"halvings":0,"cell_chars":16384,"cell_head_chars":4096},"cells_cut":0,"cells_raw":0,"read":"whole","date_system":"1900"}

{"sheet":"DATOS CARTA00","index":0,"n_rows":58,"n_cols":3,"rows_kept":58,"cut":false,"hidden":true,"merged":[]}
[1,"las faldas dada sala jaka kafka kasa kaka faja jalas laka kasada fajadaala",1]
[2,"sal faja añada sala salsa sal salada falsas alfalfa saldada fallas alada las",1]
[3,"faldas dada sala jaka kafka kasa kaka las faja jalas laka kasada fajada sal",1]
[4,"faja añada sala salsa salada faldas falsas alfalfa saldada fallas las faldas",1]
[5,"dada sala jaka kafka kasa kaka sal faja añada sal salsa salada falsas",1]
[6,"alfalfa salada fallas saldada alada las faldas dada sala jaka kafka kasa",1]
[7,"kaka faja jalas laka kasada fajada sal faja añada sala salsa salada falsas",1]
[8,"alfalfa saldada sala fallas aladas",1]
[9,"STOP",1]
[10]
[11]
[12]
[13]
[14]
[15]
[16]
[17]
[18]
[19]
[20]
[21]
[22]
[23]
[24]
[25]
[26]
[27]
[28]
[29]
[30]
[31]
[32]
[33]
[34]
[35]
[36]
[37]
[38]
[39]
[40]
[41]
[42]
[43]
[44]
[45]
[46]
[47]
[48]
[49]
[50]
[51]
[52]
[53]
[54]
[55]
[56]
[57]
[58]

{"sheet":"lec.2","index":1,"n_rows":15,"n_cols":3,"rows_kept":15,"cut":false,"hidden":true,"merged":[]}
[1,"hasada lagaña halagas gafas agasajas agallas hagas hala halla gala has",2]
[2,"alga alhajas llagas hallada kagas hadas gasas gala has alga alhaja llagas",2]
[3,"halladas kagas hadas gasas hasada lagaña halagas gafas agasajas agallas",2]
[4,"hagas hala halla hada lasaña laña gasa daga gasa gaja gada gasas hadas",2]
[5,"gasas hadas gas saga gala laga gala hadas lasaña gasa aga haga hadas",2]
[6,"gasas hadas laña hadas gasas hadas galas halladas lagañas gasa saga",2]
[7,"lasaña ñasala fajas jafas hada lagaña halagas gafas agasajas agallas halla",2]
[8,"hada lasaña laña gasa daga gas hadas laña gasa gas",2]
[9,"STOP",2]
[10]
[11]
[12]
[13]
[14]
[15]

{"sheet":"ESCRITURA","index":2,"n_rows":15,"n_cols":13,"rows_kept":15,"cut":false,"hidden":false,"merged":[[1,8,2,8],[0,10,4,10],[0,4,0,6],[3,0,3,8],[4,0,4,8],[0,9,4,9],[5,4,5,5],[13,0,13,9],[14,0,14,9],[12,0,12,9],[11,0,11,9],[10,0,10,10]]}
[null,null,null,null,"habilitar este contenido",null,null,null,null,null,null,1,{"$f":"NOW()","v":41715.697876273145}]
[{"$f":"A3-M2","v":"00:00:00.050"},null,null,null,null,"lección",{"$f":"L11","v":1},"nombre",null,null,null,null,41715.697875694445]
[{"$f":"NOW()","v":41715.697876273145},{"$f":"M1-M6","v":"00:00:20.670"},null,null,"pulsaciones",{"$f":"M5","v":""},"minuto","PAPA",null,null,null,1,{"$f":"(HOUR(L5)*3600)+(MINUTE(L5)*60+SECOND(L5))","v":0}]
[{"$f":"A11","v":"las faldas dada sala jaka kafka kasa kaka faja jalas laka kasada fajadaala"},null,null,null,null,null,null,null,null,null,null,550,{"$f":"IF(M3=0,\"\",L4/M3*60)","v":""}]
[null,null,null,null,null,null,null,null,null,null,null,{"$f":"A2","v":"00:00:00.050"},{"$f":"IF(A4=\"STOP\",M4,\"\")","v":""}]
[null,null,null,null,{"$f":"A2","v":"00:00:00.050"},null,null,null,null,null,null,{"$f":"TODAY()","v":"2014-03-17"},41715.697637037039]
[]
[]
[]
[]
[{"$f":"VLOOKUP(L1,'DATOS CARTA00'!A1:B50,2,FALSE)","v":"las faldas dada sala jaka kafka kasa kaka faja jalas laka kasada fajadaala"},null,null,null,null,null,null,null,null,null,null,{"$f":"VLOOKUP(L1,'DATOS CARTA00'!A1:C23,3,FALSE)","v":1}]
[{"$f":"VLOOKUP(L1,lec.2!A1:B17,2,FALSE)","v":"hasada lagaña halagas gafas agasajas agallas hagas hala halla gala has"},null,null,null,null,null,null,null,null,null,null,{"$f":"VLOOKUP(L1,lec.2!A1:C15,3,FALSE)","v":2}]
[{"$f":"VLOOKUP(L1,lec.03!A1:B18,2,FALSE)","v":"leña fea lisa deidad gelida seda jefe fila sida dias fije siglas del"},null,null,null,null,null,null,null,null,null,null,{"$f":"VLOOKUP(L1,lec.03!A1:C24,3,FALSE)","v":3}]
[{"$f":"VLOOKUP(L1,lec.04!A1:B10,2,FALSE)","v":"ñu regulares lugar usarse seguridad asegurar sugiere fuera guardar sufre"},null,null,null,null,null,null,null,null,null,null,{"$f":"VLOOKUP(L1,lec.04!A1:C17,3,FALSE)","v":4}]
[{"$f":"VLOOKUP(L1,lec.05!A1:B100,2,FALSE)","v":"ñoño ñoña españa que dedo porque pequeños quiero aquellos por pero paso"},null,null,null,null,null,null,null,null,null,null,{"$f":"VLOOKUP(L1,lec.05!A1:C24,3,FALSE)","v":5}]

{"sheet":"PULSACIONES","index":3,"n_rows":648,"n_cols":12,"rows_kept":648,"cut":false,"hidden":false,"merged":[[0,4,0,5]]}
[{"$f":"VLOOKUP(G1,B3:E464,4,FALSE)","v":"PAPA"},null,"tiempo","lección","PULSACIONES MINUTO",null,{"$f":"MAX((B21:B648))","v":253.84615384615384},{"$f":"VLOOKUP(G2,B3:E472,4,FALSE)","v":"PAPA"},"años","meses","días",{"$f":"A648","v":"2011-01-29"}]
[{"$f":"TODAY()","v":"2014-03-17"},null,null,null,"nombre","volver",{"$f":"LARGE(B21:B648,2)","v":253.84615384615384},{"$f":"IF(G2,A648,)","v":"2011-01-29"},{"$f":"DATEDIF(L1,A608,\"y\")","v":0},{"$f":"DATEDIF(L1,A608,\"ym\")","v":0},{"$f":"DATEDIF(L1,A608,\"d\")","v":7}]
["2013-04-03",237.41007194244602,"00:02:21.210",5,"PAPA"]
["2013-03-29",232.3943661971831,"00:02:23.780",2,"PAPA"]
["2013-03-29",202.45398773006136,"00:02:44.690",1,"PAPA"]
["2013-03-18",221.47651006711408,"00:02:30.930",5,"PAPA"]
["2013-03-18",200,"00:02:48.640",4,"PAPA"]
["2013-03-18",230.76923076923077,"00:02:26.380",3,"PAPA"]
["2013-03-18",207.54716981132077,"00:02:41.180",2,"PAPA"]
["2013-03-18",198.79518072289156,"00:02:48.110",1,"PAPA"]
["2013-03-14",229.16666666666669,"00:02:25.440",5,"PAPA"]
["2013-03-14",201.21951219512195,"00:02:45.560",4,"PAPA"]
["2013-03-14",229.16666666666669,"00:02:26.330",3,"PAPA"]
["2013-03-14",217.10526315789474,"00:02:34.610",2,"PAPA"]
["2013-03-14",232.3943661971831,"00:02:23.440",1,"PAPA"]
["2013-03-13",226.02739726027397,"00:02:27.940",5,"PAPA"]
["2013-03-13",207.54716981132077,"00:02:42.090",4,"PAPA"]
["2013-03-13",244.44444444444446,"00:02:17",3,"PAPA"]
["2013-03-13",226.02739726027397,"00:02:27.810",2,"PAPA"]
["2013-03-13",222.97297297297297,"00:02:31.640",1,"PAPA"]
["2012-03-13",210.19108280254778,"00:02:38.950",5,"PAPA"]
["2012-03-13",211.53846153846155,"00:02:38.590",4,"PAPA"]
["2012-03-13",230.76923076923077,"00:02:24.820",3,"PAPA"]
["2012-03-13",211.53846153846155,"00:02:38.480",2,"PAPA"]
["2012-03-13",220,"00:02:31.590",1,"PAPA"]
["2012-03-13",242.64705882352939,"00:02:19.140",5,"NUEVO"]
["2012-03-13",234.04255319148936,"00:02:23.110",4,"NUEVO"]
["2012-03-13",230.76923076923077,"00:02:24.690",3,"NUEVO"]
["2012-03-13",215.68627450980392,"00:02:35.570",2,"NUEVO"]
["2012-03-13",218.54304635761588,"00:02:35.090",1,"NUEVO"]
["2012-03-13",244.44444444444446,"00:02:18.550",5,"PAPA"]
["2012-03-13",215.68627450980392,"00:02:34.570",4,"PAPA"]
["2012-03-13",229.16666666666669,"00:02:25.530",3,"PAPA"]
["2012-03-13",224.48979591836735,"00:02:29.750",2,"PAPA"]
["2012-03-13",214.28571428571431,"00:02:36.670",1,"PAPA"]
["2012-03-12",221.47651006711408,"00:02:31.220",5,"PAPA"]
["2012-03-12",220,"00:02:32.350",4,"PAPA"]
["2012-03-12",214.28571428571431,"00:02:35.770",3,"PAPA"]
["2012-03-12",222.97297297297297,"00:02:29.150",2,"PAPA"]
["2012-03-12",204.96894409937889,"00:02:43.800",1,"PAPA"]
["2012-03-12",224.48979591836735,"00:02:28.700",5,"PAPA"]
["2012-03-12",214.28571428571431,"00:02:37.480",4,"PAPA"]
["2012-03-12",227.58620689655172,"00:02:27.220",3,"PAPA"]
["2012-03-12",217.10526315789474,"00:02:34.370",2,"PAPA"]
["2012-03-12",218.54304635761588,"00:02:33.040",1,"PAPA"]
["2012-03-11",111.11111111111111,"00:05:00.560",1,"Nena"]
["2012-03-11",204.96894409937889,"00:02:42.930",1,"PAPA"]
["2012-03-11",235.71428571428569,"00:02:21.990",5,"PAPA"]
["2012-03-11",214.28571428571431,"00:02:37",4,"PAPA"]
["2012-03-11",224.48979591836735,"00:02:30.300",3,"PAPA"]
["2012-03-11",230.76923076923077,"00:02:25.860",2,"PAPA"]
["2012-03-11",222.97297297297297,"00:02:31.970",1,"PAPA"]
["2012-03-11",230.76923076923077,"00:02:26.410",3,"PAPA"]
["2012-03-11",221.47651006711408,"00:02:30.830",3,"PAPA"]
["2012-03-11",220,"00:02:34.050",1,"PAPA"]
["2012-03-10",224.48979591836735,"00:02:28.890",3,"PAPA"]
["2012-03-10",210.19108280254778,"00:02:39.100",2,"PAPA"]
["2012-03-10",227.58620689655172,"00:02:27.460",1,"PAPA"]
["2012-03-10",226.02739726027397,"00:02:27.610",5,"PAPA"]
["2012-03-10",215.68627450980392,"00:02:35.420",4,"PAPA"]
["2012-03-10",226.02739726027397,"00:02:28.580",3,"PAPA"]
["2012-03-10",220,"00:02:31.550",2,"PAPA"]
["2012-03-10",202.45398773006136,"00:02:44.920",1,"PAPA"]
["2012-03-09",222.97297297297297,"00:02:29.840",5,"PAPA"]
["2012-03-09",212.90322580645162,"00:02:37.450",4,"PAPA"]
["2012-03-09",224.48979591836735,"00:02:29.250",3,"PAPA"]
["2012-03-09",210.19108280254778,"00:02:40.030",2,"PAPA"]
["2012-03-09",192.98245614035088,"00:02:52.550",1,"PAPA"]
["2012-03-08",215.68627450980392,"00:02:35.110",5,"PAPA"]
["2012-03-08",202.45398773006136,"00:02:45.390",4,"PAPA"]
["2012-03-08",224.48979591836735,"00:02:28.660",3,"PAPA"]
["2012-03-08",210.19108280254778,"00:02:40.090",2,"PAPA"]
["2012-03-08",196.42857142857142,"00:02:50.300",1,"PAPA"]
["2012-03-06",215.68627450980392,"00:02:38.230",5,"PAPA"]
["2012-03-06",217.10526315789474,"00:02:33.810",4,"PAPA"]
["2012-03-06",235.71428571428569,"00:02:21.980",3,"PAPA"]
["2012-03-06",212.90322580645162,"00:02:37.710",2,"PAPA"]
["2012-03-06",203.7037037037037,"00:02:44.560",1,"PAPA"]
["2012-03-06",229.16666666666669,"00:02:25.170",5,"PAPA"]
["2012-03-06",211.53846153846155,"00:02:37.440",4,"PAPA"]
["2012-03-06",207.54716981132077,"00:02:40.680",3,"PAPA"]
["2012-03-06",194.11764705882354,"00:02:53.010",2,"PAPA"]
["2012-03-06",204.96894409937889,"00:02:43.420",4,"PAPA"]
["2012-03-05",226.02739726027397,"00:02:28.040",5,"PAPA"]
["2012-03-05",212.90322580645162,"00:02:37.700",4,"PAPA"]
["2012-03-05",218.54304635761588,"00:02:32.390",3,"PAPA"]
["2012-03-05",208.86075949367088,"00:02:40.090",2,"PAPA"]
["2012-03-05",214.28571428571431,"00:02:35.080",1,"PAPA"]
["2012-02-28",229.16666666666669,"00:02:26.770",5,"PAPA"]
["2012-02-28",221.47651006711408,"00:02:31.670",4,"PAPA"]
["2012-02-28",232.3943661971831,"00:02:23.560",3,"PAPA"]
["2012-02-28",220,"00:02:31.910",2,"PAPA"]
["2012-02-28",217.10526315789474,"00:02:33.830",1,"PAPA"]
["2012-02-27",232.3943661971831,"00:02:25",5,"PAPA"]
["2012-02-27",235.71428571428569,"00:02:22.080",4,"PAPA"]
["2012-02-27",224.48979591836735,"00:02:29.190",3,"PAPA"]
["2012-02-27",210.19108280254778,"00:02:38.480",2,"PAPA"]
["2012-02-27",214.28571428571431,"00:02:35.660",1,"PAPA"]
["2012-02-26",221.47651006711408,"00:02:31.270",5,"PAPA"]
["2012-02-26",218.54304635761588,"00:02:32.670",4,"PAPA"]
["2012-02-26",227.58620689655172,"00:02:27.360",3,"PAPA"]
["2012-02-26",222.97297297297297,"00:02:31.170",2,"PAPA"]
["2012-02-26",218.54304635761588,"00:02:35.470",1,"PAPA"]
["2012-02-06",224.48979591836735,"00:02:30.220",5,"PAPA"]
["2012-02-06",227.58620689655172,"00:02:28.870",4,"PAPA"]
["2012-02-06",232.3943661971831,"00:02:25.500",3,"PAPA"]
["2012-02-06",229.16666666666669,"00:02:25.920",2,"PAPA"]
["2012-02-06",192.98245614035088,"00:02:53.610",1,"PAPA"]
["2012-02-01",232.3943661971831,"00:02:23.430",5,"PAPA"]
["2012-02-01",221.47651006711408,"00:02:31.050",4,"PAPA"]
["2012-02-01",217.10526315789474,"00:02:33.930",3,"PAPA"]
["2012-02-01",222.97297297297297,"00:02:29.550",2,"PAPA"]
["2012-02-01",221.47651006711408,"00:02:30.470",1,"PAPA"]
["2012-01-30",217.10526315789474,"00:02:34.910",5,"PAPA"]
["2012-01-30",214.28571428571431,"00:02:35.640",4,"PAPA"]
["2012-01-30",214.28571428571431,"00:02:37.890",3,"PAPA"]
["2012-01-30",237.41007194244602,"00:02:21.200",2,"PAPA"]
["2012-01-30",208.86075949367088,"00:02:39.910",1,"PAPA"]
["2012-01-25",230.76923076923077,"00:02:26.230",5,"PAPA"]
["2012-01-25",253.84615384615384,"00:02:11.480",4,"PAPA"]
["2012-01-25",240.87591240875912,"00:02:21.580",3,"PAPA"]
["2012-01-25",222.97297297297297,"00:02:29.480",2,"PAPA"]
["2012-01-25",202.45398773006136,"00:02:44.780",1,"PAPA"]
["2012-01-24",204.96894409937889,"00:02:42.630",5,"PAPA"]
["2012-01-24",237.41007194244602,"00:02:20.960",4,"PAPA"]
["2012-01-24",208.86075949367088,"00:02:39.870",3,"PAPA"]
["2012-01-24",210.19108280254778,"00:02:38.580",2,"PAPA"]
["2012-01-24",229.16666666666669,"00:02:26.590",1,"PAPA"]
["2012-01-23",240.87591240875912,"00:02:19.520",5,"PAPA"]
["2012-01-23",227.58620689655172,"00:02:26.590",4,"PAPA"]
["2012-01-23",242.64705882352939,"00:02:18.210",3,"PAPA"]
["2012-01-23",226.02739726027397,"00:02:28.140",2,"PAPA"]
["2012-01-23",203.7037037037037,"00:02:45.640",1,"PAPA"]
["2012-01-22",221.47651006711408,"00:02:31.200",5,"PAPA"]
["2012-01-22",235.71428571428569,"00:02:22.340",4,"PAPA"]
["2012-01-22",226.02739726027397,"00:02:28.550",3,"PAPA"]
["2012-01-22",224.48979591836735,"00:02:29.360",2,"PAPA"]
["2012-01-22",204.96894409937889,"00:02:44.490",1,"PAPA"]
["2012-01-20",237.41007194244602,"00:02:21.270",5,"PAPA"]
["2012-01-20",248.12030075187968,"00:02:15.130",4,"PAPA"]
["2012-01-20",253.84615384615384,"00:02:12.310",3,"PAPA"]
["2012-01-20",239.13043478260869,"00:02:19.540",2,"PAPA"]
["2012-01-20",218.54304635761588,"00:02:32.330",1,"PAPA"]
["2012-01-20",212.90322580645162,"00:02:37.660",5,"PAPA"]
["2012-01-20",237.41007194244602,"00:02:22.270",4,"PAPA"]
["2012-01-20",230.76923076923077,"00:02:25.750",3,"PAPA"]
["2012-01-20",215.68627450980392,"00:02:37.270",2,"PAPA"]
["2012-01-20",204.96894409937889,"00:02:44.090",1,"PAPA"]
["2012-01-15",217.10526315789474,"00:02:34.140",5,"PAPA"]
["2012-01-15",242.64705882352939,"00:02:17.840",4,"PAPA"]
["2012-01-15",239.13043478260869,"00:02:19.190",3,"PAPA"]
["2012-01-15",237.41007194244602,"00:02:20.490",2,"PAPA"]
["2012-01-15",227.58620689655172,"00:02:27.740",1,"PAPA"]
["2012-01-14",212.90322580645162,"00:02:37.220",5,"PAPA"]
["2012-01-14",229.16666666666669,"00:02:26.470",4,"PAPA"]
["2012-01-14",218.54304635761588,"00:02:33.280",3,"PAPA"]
["2012-01-14",204.96894409937889,"00:02:44.550",2,"PAPA"]
["2012-01-14",208.86075949367088,"00:02:41.920",1,"PAPA"]
["2012-01-13",221.47651006711408,"00:02:30.330",5,"PAPA"]
["2012-01-13",235.71428571428569,"00:02:22.670",4,"PAPA"]
["2012-01-13",218.54304635761588,"00:02:33.180",3,"PAPA"]
["2012-01-13",212.90322580645162,"00:02:38.080",2,"PAPA"]
["2012-01-13",180.32786885245901,"00:03:05.630",1,"PAPA"]
["2012-01-11",212.90322580645162,"00:02:38.930",2,"PAPA"]
["2012-01-11",222.97297297297297,"00:02:30.040",1,"PAPA"]
["2012-01-08",207.54716981132077,"00:02:41.360",5,"PAPA"]
["2012-01-08",240.87591240875912,"00:02:18.560",4,"PAPA"]
["2012-01-08",224.48979591836735,"00:02:28.530",3,"PAPA"]
["2012-01-08",220,"00:02:31.470",2,"PAPA"]
["2012-01-08",214.28571428571431,"00:02:35.650",1,"PAPA"]
["2012-01-06",214.28571428571431,"00:02:35.620",5,"PAPA"]
["2012-01-06",218.54304635761588,"00:02:33.170",4,"PAPA"]
["2012-01-06",214.28571428571431,"00:02:36.080",3,"PAPA"]
["2012-01-06",207.54716981132077,"00:02:40.800",2,"PAPA"]
["2012-01-06",197.60479041916167,"00:02:48.390",1,"PAPA"]
["2012-01-04",232.3943661971831,"00:02:26.070",5,"PAPA"]
["2012-01-04",214.28571428571431,"00:02:35.690",4,"PAPA"]
["2012-01-04",203.7037037037037,"00:02:45.460",3,"PAPA"]
["2012-01-04",197.60479041916167,"00:02:49.320",2,"PAPA"]
["2012-01-04",191.86046511627907,"00:02:54.140",1,"PAPA"]
["2012-01-02",210.19108280254778,"00:02:39.360",5,"PAPA"]
["2012-01-02",222.97297297297297,"00:02:29.290",4,"PAPA"]
["2012-01-02",229.16666666666669,"00:02:25.770",3,"PAPA"]
["2012-01-02",204.96894409937889,"00:02:43.600",2,"PAPA"]
["2012-01-02",208.86075949367088,"00:02:40.210",1,"PAPA"]
["2012-01-02",234.04255319148936,"00:02:22.830",5,"PAPA"]
["2012-01-02",221.47651006711408,"00:02:30.990",4,"PAPA"]
["2012-01-02",224.48979591836735,"00:02:29.680",3,"PAPA"]
["2012-01-02",211.53846153846155,"00:02:38.440",2,"PAPA"]
["2012-01-02",218.54304635761588,"00:02:33.350",1,"PAPA"]
["2012-01-01",227.58620689655172,"00:02:26.530",5,"PAPA"]
["2012-01-01",227.58620689655172,"00:02:27.120",4,"PAPA"]
["2012-01-01",244.44444444444446,"00:02:17.450",3,"PAPA"]
["2012-01-01",222.97297297297297,"00:02:30.500",2,"PAPA"]
["2012-01-01",214.28571428571431,"00:02:35.680",1,"PAPA"]
["2012-01-01",214.28571428571431,"00:02:35.980",5,"PAPA"]
["2012-01-01",224.48979591836735,"00:02:29.010",4,"PAPA"]
["2012-01-01",220,"00:02:32.240",3,"PAPA"]
["2012-01-01",206.25,"00:02:42.310",2,"PAPA"]
["2012-01-01",181.31868131868131,"00:03:04.250",1,"PAPA"]
["2011-12-30",220,"00:02:31.610",5,"PAPA"]
["2011-12-30",221.47651006711408,"00:02:30.970",4,"PAPA"]
["2011-12-30",242.64705882352939,"00:02:18.130",3,"PAPA"]
["2011-12-30",212.90322580645162,"00:02:37.780",2,"PAPA"]
["2011-12-30",208.86075949367088,"00:02:39.260",1,"PAPA"]
["2011-12-29",215.68627450980392,"00:02:35.110",5,"PAPA"]
["2011-12-29",227.58620689655172,"00:02:27.490",4,"PAPA"]
["2011-12-29",220,"00:02:31.570",3,"PAPA"]
["2011-12-29",214.28571428571431,"00:02:37.360",2,"PAPA"]
["2011-12-29",217.10526315789474,"00:02:33.650",1,"PAPA"]
["2011-12-29",220,"00:02:32.110",5,"PAPA"]
["2011-12-29",226.02739726027397,"00:02:28.170",4,"PAPA"]
["2011-12-29",232.3943661971831,"00:02:24.150",3,"PAPA"]
["2011-12-29",229.16666666666669,"00:02:25.240",2,"PAPA"]
["2011-12-29",214.28571428571431,"00:02:36",1,"PAPA"]
["2011-12-28",220,"00:02:32.300",5,"PAPA"]
["2011-12-28",211.53846153846155,"00:02:39.540",4,"PAPA"]
["2011-12-28",217.10526315789474,"00:02:33.970",3,"PAPA"]
["2011-12-28",203.7037037037037,"00:02:44.810",1,"PAPA"]
["2011-12-28",197.60479041916167,"00:02:50.990",1,"PAPA"]
["2011-12-27",242.64705882352939,"00:02:17.830",5,"PAPA"]
["2011-12-27",221.47651006711408,"00:02:30.460",4,"PAPA"]
["2011-12-27",235.71428571428569,"00:02:21.640",3,"PAPA"]
["2011-12-27",217.10526315789474,"00:02:34.620",2,"PAPA"]
["2011-12-27",202.45398773006136,"00:02:45.820",1,"PAPA"]
["2011-12-26",222.97297297297297,"00:02:29.730",5,"PAPA"]
["2011-12-26",212.90322580645162,"00:02:38.320",4,"PAPA"]
["2011-12-26",197.60479041916167,"00:02:49.060",3,"PAPA"]
["2011-12-26",196.42857142857142,"00:02:50.600",2,"PAPA"]
["2011-12-26",195.26627218934914,"00:02:51.220",1,"PAPA"]
["2011-12-25",218.54304635761588,"00:02:33.580",5,"PAPA"]
["2011-12-25",232.3943661971831,"00:02:25",4,"PAPA"]
["2011-12-25",221.47651006711408,"00:02:30.920",3,"PAPA"]
["2011-12-25",224.48979591836735,"00:02:28.500",2,"PAPA"]
["2011-12-25",197.60479041916167,"00:02:48.380",1,"PAPA"]
["2011-12-25",218.54304635761588,"00:02:33.350",5,"PAPA"]
["2011-12-25",201.21951219512195,"00:02:46.090",4,"PAPA"]
["2011-12-25",208.86075949367088,"00:02:39.500",3,"PAPA"]
["2011-12-25",217.10526315789474,"00:02:34",2,"PAPA"]
["2011-12-25",190.75144508670522,"00:02:55",1,"PAPA"]
["2011-12-24",200,"00:02:48.090",5,"PAPA"]
["2011-12-24",230.76923076923077,"00:02:24.730",4,"PAPA"]
["2011-12-24",224.48979591836735,"00:02:29.360",3,"PAPA"]
["2011-12-24",217.10526315789474,"00:02:34.190",2,"PAPA"]
["2011-12-24",222.97297297297297,"00:02:30.160",1,"PAPA"]
["2011-12-23",217.10526315789474,"00:02:34",5,"PAPA"]
["2011-12-23",204.96894409937889,"00:02:43.680",4,"PAPA"]
["2011-12-23",204.96894409937889,"00:02:43.160",3,"PAPA"]
["2011-12-23",194.11764705882354,"00:02:51.640",2,"PAPA"]
["2011-12-23",203.7037037037037,"00:02:44.070",1,"PAPA"]
["2011-12-22",227.58620689655172,"00:02:27.030",5,"PAPA"]
["2011-12-22",202.45398773006136,"00:02:44.510",4,"PAPA"]
["2011-12-22",220,"00:02:31.910",3,"PAPA"]
["2011-12-22",229.16666666666669,"00:02:26.120",2,"PAPA"]
["2011-12-22",187.5,"00:02:58.060",1,"PAPA"]
["2011-12-22",194.11764705882354,"00:02:52.070",2,"PAPA"]
["2011-12-22",195.26627218934914,"00:02:51.320",1,"PAPA"]
["2011-12-21",229.16666666666669,"00:02:26.270",5,"PAPA"]
["2011-12-21",237.41007194244602,"00:02:27.230",4,"PAPA"]
["2011-12-21",211.53846153846155,"00:02:38.580",3,"PAPA"]
["2011-12-21",221.47651006711408,"00:02:31.250",2,"PAPA"]
["2011-12-21",217.10526315789474,"00:02:35.360",1,"PAPA"]
["2011-12-21",220,"00:02:32.650",5,"PAPA"]
["2011-12-21",214.28571428571431,"00:02:35.820",4,"PAPA"]
["2011-12-21",226.02739726027397,"00:02:28.200",3,"PAPA"]
["2011-12-21",218.54304635761588,"00:02:33.280",2,"PAPA"]
["2011-12-21",207.54716981132077,"00:02:41.190",1,"PAPA"]
["2011-12-19",232.3943661971831,"00:02:28",5,"PAPA"]
["2011-12-19",221.47651006711408,"00:02:30.940",4,"PAPA"]
["2011-12-19",224.48979591836735,"00:02:28.330",3,"PAPA"]
["2011-12-19",212.90322580645162,"00:02:36.960",2,"PAPA"]
["2011-12-19",207.54716981132077,"00:02:41.480",1,"PAPA"]
["2011-12-18",217.10526315789474,"00:02:34.310",5,"PAPA"]
["2011-12-18",218.54304635761588,"00:02:32.140",4,"PAPA"]
["2011-12-18",224.48979591836735,"00:02:28.930",3,"PAPA"]
["2011-12-18",212.90322580645162,"00:02:38.530",2,"PAPA"]
["2011-12-18",207.54716981132077,"00:02:42.030",1,"PAPA"]
["2011-12-17",226.02739726027397,"00:02:27.050",5,"joan vale"]
["2011-12-17",212.90322580645162,"00:02:37.400",4,"joan vale"]
["2011-12-17",215.68627450980392,"00:02:35.280",3,"joan vale"]
["2011-12-17",206.25,"00:02:41.980",2,"joan vale"]
["2011-12-17",201.21951219512195,"00:02:45.480",1,"joan vale"]
["2011-12-14",234.04255319148936,"00:02:22.810",5,"yo otra vez"]
["2011-12-14",224.48979591836735,"00:02:29.110",4,"yo otra vez"]
["2011-12-14",217.10526315789474,"00:02:33.580",3,"yo otra vez"]
["2011-12-14",220,"00:02:32.520",2,"yo otra vez"]
["2011-12-14",207.54716981132077,"00:02:52.420",1,"yo otra vez"]
["2011-12-12",226.02739726027397,"00:02:27.640",5,"yo mismo0110"]
["2011-12-12",229.16666666666669,"00:02:25.190",4,"yo mismo0110"]
["2011-12-12",215.68627450980392,"00:02:34.750",3,"yo mismo0110"]
["2011-12-12",212.90322580645162,"00:02:36.140",2,"yo mismo0110"]
["2011-12-12",192.98245614035088,"00:02:51.760",1,"yo mismo0110"]
["2011-12-11",222.97297297297297,"00:02:29.500",3,"yo mismo0110"]
["2011-12-11",214.28571428571431,"00:02:36.490",2,"yo mismo0110"]
["2011-12-11",204.96894409937889,"00:02:42.570",1,"yo mismo0110"]
["2011-12-09",218.54304635761588,"00:02:32.910",2,"papito"]
["2011-12-09",211.53846153846155,"00:02:38.030",1,"papito"]
["2011-12-08",204.96894409937889,"00:02:42.380",5,"JOANNOSTRO_1"]
["2011-12-08",217.10526315789474,"00:02:33.450",4,"JOANNOSTRO_1"]
["2011-12-08",208.86075949367088,"00:02:40.730",3,"JOANNOSTRO_1"]
["2011-12-08",202.45398773006136,"00:02:43.910",2,"JOANNOSTRO_1"]
["2011-12-08",207.54716981132077,"00:02:40.090",1,"JOANNOSTRO_1"]
["2011-12-08",210.19108280254778,"00:02:38.430",1,"JOAN 321"]
["2011-12-07",217.10526315789474,"00:02:34.200",5,"JOAN 321"]
["2011-12-07",240.87591240875912,"00:02:18.530",4,"JOAN 321"]
["2011-12-07",246.26865671641792,"00:02:14.700",3,"JOAN 321"]
["2011-12-07",226.02739726027397,"00:02:27.220",2,"JOAN 321"]
["2011-12-07",208.86075949367088,"00:02:39.050",1,"JOAN 321"]
["2011-12-07",220,"00:02:32.060",1,"joan321"]
["2011-12-06",208.86075949367088,"00:02:40.590",5,"joan321"]
["2011-12-06",218.54304635761588,"00:02:33.150",4,"joan321"]
["2011-12-06",227.58620689655172,"00:02:26.440",3,"joan321"]
["2011-12-06",203.7037037037037,"00:02:43.890",2,"joan321"]
["2011-12-06",196.42857142857142,"00:02:50.120",1,"joan321"]
["2011-11-28",206.25,"00:02:42.360",5,"joan321"]
["2011-11-28",221.47651006711408,"00:02:30.200",4,"joan321"]
["2011-11-28",211.53846153846155,"00:02:38.190",3,"joan321"]
["2011-11-28",201.21951219512195,"00:02:46.580",2,"joan321"]
["2011-11-28",208.86075949367088,"00:02:40.010",1,"joan321"]
["2011-11-27",222.97297297297297,"00:02:29.520",5,"joan1234"]
["2011-11-27",221.47651006711408,"00:02:30",4,"joan1234"]
["2011-11-27",217.10526315789474,"00:02:34.020",3,"joan1234"]
["2011-11-27",222.97297297297297,"00:02:29.570",2,"joan1234"]
["2011-11-27",192.98245614035088,"00:02:53.610",1,"joan1234"]
["2011-11-26",222.97297297297297,"00:02:29.310",5,"joan101"]
["2011-11-26",229.16666666666669,"00:02:25.530",4,"joan101"]
["2011-11-26",214.28571428571431,"00:02:36.280",3,"joan101"]
["2011-11-26",198.79518072289156,"00:02:47.930",2,"joan101"]
["2011-11-26",204.96894409937889,"00:02:42.750",1,"joan101"]
["2011-11-25",208.86075949367088,"00:02:39.930",5,"JOANNOSTRO01"]
["2011-11-25",227.58620689655172,"00:02:27.420",4,"JOANNOSTRO01"]
["2011-11-25",235.71428571428569,"00:02:21.730",3,"JOANNOSTRO01"]
["2011-11-25",210.19108280254778,"00:02:38.920",2,"JOANNOSTRO01"]
["2011-11-25",200,"00:02:46.460",1,"JOANNOSTRO01"]
["2011-11-22",229.16666666666669,"00:02:25.340",5,"JOANNOSTRO01"]
["2011-11-22",224.48979591836735,"00:02:28.360",4,"JOANNOSTRO01"]
["2011-11-22",207.54716981132077,"00:02:39.010",3,"JOANNOSTRO01"]
["2011-11-22",198.79518072289156,"00:02:48.280",2,"JOANNOSTRO01"]
["2011-11-22",187.5,"00:02:58.190",1,"JOANNOSTRO01"]
["2011-11-19",229.16666666666669,"00:02:25.420",5,"JOAN 0016"]
["2011-11-19",234.04255319148936,"00:02:23.190",4,"JOAN 0016"]
["2011-11-19",232.3943661971831,"00:02:24.530",3,"JOAN 0016"]
["2011-11-19",215.68627450980392,"00:02:35.450",2,"JOAN 0016"]
["2011-11-19",195.26627218934914,"00:02:51.470",1,"JOAN 0016"]
["2011-11-17",194.11764705882354,"00:02:52.670",5,"JOAN 012"]
["2011-11-17",217.10526315789474,"00:02:34.650",4,"JOAN 012"]
["2011-11-17",197.60479041916167,"00:02:48.220",3,"JOAN 012"]
["2011-11-17",172.77486910994764,"00:03:13.410",2,"JOAN 012"]
["2011-11-17",182.32044198895028,"00:03:03.380",1,"JOAN 012"]
["2011-11-07",212.90322580645162,"00:02:36.060",5,"JOAN 011"]
["2011-11-07",212.90322580645162,"00:02:36.730",4,"JOAN 011"]
["2011-11-07",232.3943661971831,"00:02:23.710",3,"JOAN 011"]
["2011-11-07",226.02739726027397,"00:02:27.550",2,"JOAN 011"]
["2011-11-07",221.47651006711408,"00:02:30.660",1,"JOAN 011"]
["2011-11-06",232.3943661971831,"00:02:23.350",5,"JOAN010"]
["2011-11-06",239.13043478260869,"00:02:19.140",4,"JOAN010"]
["2011-11-06",220,"00:02:31.610",3,"JOAN010"]
["2011-11-06",217.10526315789474,"00:02:34.530",2,"JOAN010"]
["2011-11-06",195.26627218934914,"00:02:50.940",1,"JOAN010"]
["2011-11-05",215.68627450980392,"00:02:34.570",5,"JAON 09"]
["2011-11-05",220,"00:02:31.530",4,"JAON 09"]
["2011-11-05",242.64705882352939,"00:02:17.800",3,"JAON 09"]
["2011-11-05",230.76923076923077,"00:02:24.900",2,"JAON 09"]
["2011-11-05",204.96894409937889,"00:02:42.390",1,"JAON 09"]
["2011-11-03",212.90322580645162,"00:02:36.470",2,"JOAN 08"]
["2011-11-03",214.28571428571431,"00:02:35.550",1,"JOAN 08"]
["2011-11-02",217.10526315789474,"00:02:34.560",5,"JOAN 07"]
["2011-11-02",237.41007194244602,"00:02:21.400",4,"JOAN 07"]
["2011-11-02",227.58620689655172,"00:02:27.170",3,"JOAN 07"]
["2011-11-02",196.42857142857142,"00:02:49.730",2,"JOAN 07"]
["2011-11-02",206.25,"00:02:43.060",1,"JOAN 07"]
["2011-10-28",234.04255319148936,"00:02:23.660",5,"Joan 06"]
["2011-10-28",230.76923076923077,"00:02:24.970",4,"Joan 06"]
["2011-10-28",227.58620689655172,"00:02:27.050",3,"Joan 06"]
["2011-10-28",220,"00:02:32.320",2,"Joan 06"]
["2011-10-28",206.25,"00:02:42.120",1,"Joan 06"]
["2011-10-27",217.10526315789474,"00:02:34.300",5,"Joan 06"]
["2011-10-27",253.84615384615384,"00:02:11.530",4,"Joan 06"]
["2011-10-27",229.16666666666669,"00:02:26.170",3,"Joan 06"]
["2011-10-27",221.47651006711408,"00:02:31.050",2,"Joan 06"]
["2011-10-27",214.28571428571431,"00:02:35.440",1,"Joan 06"]
["2011-10-25",222.97297297297297,"00:02:29.640",5,"Joan 06"]
["2011-10-25",221.47651006711408,"00:02:30.920",4,"Joan 06"]
["2011-10-25",206.25,"00:02:42.060",3,"Joan 06"]
["2011-10-25",191.86046511627907,"00:02:53.600",2,"Joan 06"]
["2011-10-25",212.90322580645162,"00:02:36.740",1,"Joan 06"]
["2011-10-25",229.16666666666669,"00:02:26.750",5,"Joan 06"]
["2011-10-25",222.97297297297297,"00:02:30.800",4,"Joan 06"]
["2011-10-25",229.16666666666669,"00:02:25.930",3,"Joan 06"]
["2011-10-25",206.25,"00:02:42.020",2,"Joan 06"]
["2011-10-25",200,"00:02:49.280",1,"Joan 06"]
["2011-10-23",222.97297297297297,"00:02:29.150",5,"JOAN05"]
["2011-10-23",229.16666666666669,"00:02:26.250",4,"JOAN05"]
["2011-10-23",220,"00:02:32.590",3,"JOAN05"]
["2011-10-23",190.75144508670522,"00:02:55.250",2,"JOAN05"]
["2011-10-23",197.60479041916167,"00:02:49.550",1,"JOAN05"]
["2011-10-17",215.68627450980392,"00:02:35.160",5,"joan04"]
["2011-10-17",222.97297297297297,"00:02:29.970",4,"joan04"]
["2011-10-17",234.04255319148936,"00:02:22.320",3,"joan04"]
["2011-10-17",201.21951219512195,"00:02:45.200",2,"joan04"]
["2011-10-17",210.19108280254778,"00:02:38.580",1,"joan04"]
["2011-10-17",215.68627450980392,"00:02:35.230",5,"JOAN 03"]
["2011-10-17",232.3943661971831,"00:02:24.040",4,"JOAN 03"]
["2011-10-17",235.71428571428569,"00:02:21.770",3,"JOAN 03"]
["2011-10-17",189.65517241379311,"00:02:56.110",2,"JOAN 03"]
["2011-10-17",217.10526315789474,"00:02:34.150",1,"JOAN 03"]
["2011-10-17",215.68627450980392,"00:02:35.240",1,"JOAN 03"]
["2011-10-15",207.54716981132077,"00:02:40.610",5,"joan 02"]
["2011-10-15",222.97297297297297,"00:02:29.860",4,"joan 02"]
["2011-10-15",226.02739726027397,"00:02:27.770",3,"joan 02"]
["2011-10-15",196.42857142857142,"00:02:49.580",2,"joan 02"]
["2011-10-15",207.54716981132077,"00:02:40.430",1,"joan 02"]
["2011-10-14",226.02739726027397,"00:02:28.110",5,"joan 01"]
["2011-10-14",222.97297297297297,"00:02:30.360",4,"joan 01"]
["2011-10-14",224.48979591836735,"00:02:29.850",3,"joan 01"]
["2011-10-14",207.54716981132077,"00:02:41.840",2,"joan 01"]
["2011-10-14",196.42857142857142,"00:03:02.050",1,"joan 01"]
["2011-10-03",211.53846153846155,"00:02:39.030",5,"soy yo mismo"]
["2011-10-03",224.48979591836735,"00:02:29.700",4,"soy yo mismo"]
["2011-10-03",207.54716981132077,"00:02:41.640",3,"soy yo mismo"]
["2011-10-03",196.42857142857142,"00:02:49.760",2,"soy yo mismo"]
["2011-10-03",207.54716981132077,"00:02:40.190",1,"soy yo mismo"]
["2011-09-30",218.54304635761588,"00:02:32.860",5,"soy yo mismo"]
["2011-09-30",230.76923076923077,"00:02:24.640",4,"soy yo mismo"]
["2011-09-30",227.58620689655172,"00:02:26.750",3,"soy yo mismo"]
["2011-09-30",220,"00:02:31.460",2,"soy yo mismo"]
["2011-09-30",210.19108280254778,"00:02:38.650",1,"soy yo mismo"]
["2011-09-27",217.10526315789474,"00:02:33.910",5,"me llamo yo"]
["2011-09-27",222.97297297297297,"00:02:30.210",4,"me llamo yo"]
["2011-09-27",210.19108280254778,"00:02:38.590",3,"me llamo yo"]
["2011-09-27",210.19108280254778,"00:02:38.690",2,"me llamo yo"]
["2011-09-27",214.28571428571431,"00:02:36.830",1,"me llamo yo"]
["2011-09-25",232.3943661971831,"00:02:23.850",5,"YO     MISMO"]
["2011-09-25",208.86075949367088,"00:02:40.120",4,"YO     MISMO"]
["2011-09-25",215.68627450980392,"00:02:34.570",3,"YO     MISMO"]
["2011-09-25",204.96894409937889,"00:02:43",2,"YO     MISMO"]
["2011-09-25",192.98245614035088,"00:02:53.340",1,"YO     MISMO"]
["2011-09-23",215.68627450980392,"00:02:34.780",5,"YO     MISMO"]
["2011-09-23",212.90322580645162,"00:02:37.080",4,"YO     MISMO"]
["2011-09-23",214.28571428571431,"00:02:37.330",3,"YO     MISMO"]
["2011-09-23",217.10526315789474,"00:02:34.890",2,"YO     MISMO"]
["2011-09-23",201.21951219512195,"00:02:45.690",1,"YO     MISMO"]
["2011-09-21",218.54304635761588,"00:02:32.840",5,"PAPI"]
["2011-09-21",234.04255319148936,"00:02:22.420",4,"PAPI"]
["2011-09-21",232.3943661971831,"00:02:24.560",3,"PAPI"]
["2011-09-21",211.53846153846155,"00:02:37.990",2,"PAPI"]
["2011-09-21",212.90322580645162,"00:02:37.390",1,"PAPI"]
["2011-09-20",212.90322580645162,"00:02:36.240",5,"PAPI"]
["2011-09-20",222.97297297297297,"00:02:29.660",4,"PAPI"]
["2011-09-20",220,"00:02:31.100",3,"PAPI"]
["2011-09-20",203.7037037037037,"00:02:43.610",2,"PAPI"]
["2011-09-20",206.25,"00:02:42.280",1,"PAPI"]
["2011-09-19",239.13043478260869,"00:02:19.800",5,"PAPA"]
["2011-09-19",246.26865671641792,"00:02:15.210",4,"PAPA"]
["2011-09-19",242.64705882352939,"00:02:17.690",3,"PAPA"]
["2011-09-19",203.7037037037037,"00:02:44.190",2,"PAPA"]
["2011-09-19",206.25,"00:02:41.660",1,"PAPA"]
["2011-09-15",226.02739726027397,"00:02:27.480",5,"joannostro"]
["2011-09-15",234.04255319148936,"00:02:22.420",4,"joannostro"]
["2011-09-15",240.87591240875912,"00:02:18.500",3,"joannostro"]
["2011-09-15",217.10526315789474,"00:02:33.570",2,"joannostro"]
["2011-09-15",218.54304635761588,"00:02:32.970",1,"joannostro"]
["2011-09-09",220,"00:02:31.670",5,"som en Joan"]
["2011-09-09",240.87591240875912,"00:02:19.230",4,"som en Joan"]
["2011-09-09",230.76923076923077,"00:02:25.040",3,"som en Joan"]
["2011-09-09",195.26627218934914,"00:02:51.500",2,"som en Joan"]
["2011-09-09",208.86075949367088,"00:02:40.860",1,"som en Joan"]
["2011-09-04",240.87591240875912,"00:02:18.890",5,"JOANNOSTRO"]
["2011-09-04",244.44444444444446,"00:02:16.950",4,"JOANNOSTRO"]
["2011-09-04",214.28571428571431,"00:02:35.400",3,"JOANNOSTRO"]
["2011-09-04",214.28571428571431,"00:02:36.260",2,"JOANNOSTRO"]
["2011-09-04",207.54716981132077,"00:02:40.810",1,"JOANNOSTRO"]
["2011-08-28",206.25,"00:02:41.780",5,"JOAN"]
["2011-08-28",230.76923076923077,"00:02:25.080",4,"JOAN"]
["2011-08-28",229.16666666666669,"00:02:26.620",3,"JOAN"]
["2011-08-28",212.90322580645162,"00:02:37.250",2,"JOAN"]
["2011-08-28",215.68627450980392,"00:02:34.620",1,"JOAN"]
["2011-08-18",211.53846153846155,"00:02:37.720",5,"vamos"]
["2011-08-18",232.3943661971831,"00:02:23.530",4,"vamos"]
["2011-08-18",246.26865671641792,"00:02:16.140",3,"vamos"]
["2011-08-18",208.86075949367088,"00:02:39.730",2,"vamos"]
["2011-08-18",206.25,"00:02:42.550",1,"vamos"]
["2011-08-14",217.10526315789474,"00:02:33.640",5,"vamos"]
["2011-08-14",234.04255319148936,"00:02:23.090",4,"vamos"]
["2011-08-14",244.44444444444446,"00:02:17.730",3,"vamos"]
["2011-08-14",200,"00:02:46.530",2,"vamos"]
["2011-08-14",214.28571428571431,"00:02:35.970",1,"vamos"]
["2011-08-10",217.10526315789474,"00:02:34.440",5,"yo mismo"]
["2011-08-10",217.10526315789474,"00:02:34.280",4,"yo mismo"]
["2011-08-10",220,"00:02:31.510",3,"yo mismo"]
["2011-08-10",207.54716981132077,"00:02:40.360",2,"yo mismo"]
["2011-08-10",203.7037037037037,"00:02:44.620",1,"yo mismo"]
["2011-07-29",214.28571428571431,"00:02:35.650",5,"papa"]
["2011-07-29",226.02739726027397,"00:02:28.720",4,"papa"]
["2011-07-29",235.71428571428569,"00:02:22.490",3,"papa"]
["2011-07-29",194.11764705882354,"00:02:52.720",2,"papa"]
["2011-07-29",200,"00:02:47.170",1,"papa"]
["2011-07-24",206.25,"00:02:42",5,"papito vale"]
["2011-07-24",217.10526315789474,"00:02:34.530",4,"papito vale"]
["2011-07-24",208.86075949367088,"00:02:40.140",3,"papito vale"]
["2011-07-24",195.26627218934914,"00:02:51.710",2,"papito vale"]
["2011-07-24",196.42857142857142,"00:02:50.390",1,"papito vale"]
["2011-07-19",217.10526315789474,"00:02:34.080",5,"joannostro"]
["2011-07-19",230.76923076923077,"00:02:25.530",4,"joannostro"]
["2011-07-19",202.45398773006136,"00:02:44.730",3,"joannostro"]
["2011-07-19",192.98245614035088,"00:02:55.170",2,"joannostro"]
["2011-07-19",192.98245614035088,"00:02:53.280",1,"joannostro"]
["2011-07-12",222.97297297297297,"00:02:29.920",5,"yo meteix"]
["2011-07-12",215.68627450980392,"00:02:34.830",4,"yo meteix"]
["2011-07-12",214.28571428571431,"00:02:36.230",3,"yo meteix"]
["2011-07-12",212.90322580645162,"00:02:36.730",2,"yo meteix"]
["2011-07-12",203.7037037037037,"00:02:44.250",1,"yo meteix"]
["2011-06-29",215.68627450980392,"00:02:35.470",5,"prueba papi"]
["2011-06-29",220,"00:02:31.870",4,"prueba papi"]
["2011-06-29",194.11764705882354,"00:02:51.500",3,"prueba papi"]
["2011-06-29",183.33333333333331,"00:03:02.380",2,"prueba papi"]
["2011-06-29",177.41935483870969,"00:03:07.380",1,"prueba papi"]
["2011-06-17",214.28571428571431,"00:02:35.240",5,"prueba"]
["2011-06-17",210.19108280254778,"00:02:38.800",4,"prueba"]
["2011-06-17",217.10526315789474,"00:02:34.080",3,"prueba"]
["2011-06-17",200,"00:02:46.770",2,"prueba"]
["2011-06-17",169.23076923076925,"00:03:18.520",1,"prueba"]
["2011-06-08",200,"00:02:47.020",5,"PAPITO"]
["2011-06-08",217.10526315789474,"00:02:34.170",4,"PAPITO"]
["2011-06-08",208.86075949367088,"00:02:40.540",3,"PAPITO"]
["2011-06-08",169.23076923076925,"00:03:18.920",2,"PAPITO"]
["2011-06-08",185.3932584269663,"00:03:00.890",1,"PAPITO"]
["2011-05-30",203.7037037037037,"00:02:43.960",5,"PAPITO"]
["2011-05-30",221.47651006711408,"00:02:30.610",4,"PAPITO"]
["2011-05-30",220,"00:02:32.390",3,"PAPITO"]
["2011-05-30",181.31868131868131,"00:03:03.430",2,"PAPITO"]
["2011-05-30",206.25,"00:02:42.270",1,"PAPITO"]
["2011-05-23",190.75144508670522,"00:03:10.760",1,"joan nostro"]
["2011-05-23",189.65517241379311,"00:02:56.950",5,"joan nostro"]
["2011-05-23",222.97297297297297,"00:02:29.850",4,"joan nostro"]
["2011-05-23",206.25,"00:02:43.020",3,"joan nostro"]
["2011-05-23",198.79518072289156,"00:02:49.010",2,"joan nostro"]
["2011-05-23",211.53846153846155,"00:02:42.410",1,"joan nostro"]
["2011-03-21",195.26627218934914,"00:02:52.180",2,"PAPITO"]
["2011-03-21",202.45398773006136,"00:02:45.710",1,"PAPITO"]
["2011-03-21",208.86075949367088,"00:02:40.760",5,"PAPITO"]
["2011-03-21",210.19108280254778,"00:02:42.180",4,"PAPITO"]
["2011-03-21",224.48979591836735,"00:02:29.800",3,"PAPITO"]
["2011-02-19",192.98245614035088,"00:02:52.590",5,"PAPITO"]
["2011-02-19",202.45398773006136,"00:02:44.640",4,"PAPITO"]
["2011-02-19",204.96894409937889,"00:02:42.690",3,"PAPITO"]
["2011-02-19",182.32044198895028,"00:03:02.420",2,"PAPITO"]
["2011-02-19",183.33333333333331,"00:03:01.940",1,"PAPITO"]
["2011-02-17",192.98245614035088,"00:02:57.880",1,"PAPITO"]
["2011-02-17",214.28571428571431,"00:02:35.930",4,"PAPITO"]
["2011-02-17",210.19108280254778,"00:02:38.500",3,"PAPITO"]
["2011-02-17",177.41935483870969,"00:03:07.940",2,"PAPITO"]
["2011-02-17",192.98245614035088,"00:02:52.750",1,"PAPITO"]
["2011-02-17",214.28571428571431,"00:02:36.130",4,"PAPITO"]
["2011-02-17",192.98245614035088,"00:02:52.220",3,"PAPITO"]
["2011-02-17",188.57142857142856,"00:02:56.760",3,"PAPITO"]
["2011-02-17",189.65517241379311,"00:02:55.770",2,"PAPITO"]
["2011-02-17",172.77486910994764,"00:03:12.750",2,"PAPITO"]
["2011-02-17",192.98245614035088,"00:02:52.010",1,"PAPITO"]
["2011-02-17",184.35754189944134,"00:03:00.320",1,"PAPITO"]
["2011-02-17",194.11764705882354,"00:02:51.400",1,"PAPITO"]
["2011-02-17",179.34782608695653,"00:03:05.250",1,"PAPITO"]
["2011-02-15",139.83050847457628,"00:03:57.170",5,"PAPITO"]
["2011-02-15",200,"00:02:45.860",4,"PAPITO"]
["2011-02-15",196.42857142857142,"00:02:49.300",3,"PAPITO"]
["2011-02-15",184.35754189944134,"00:03:00.810",2,"PAPITO"]
["2011-02-15",169.23076923076925,"00:03:16.420",2,"PAPITO"]
["2011-02-15",187.5,"00:02:56.670",1,"PAPITO"]
["2011-02-15",154.92957746478874,"00:03:34.770",1,"PAPITO"]
["2011-02-14",201.21951219512195,"00:02:45.260",3,"PAPITO"]
["2011-02-14",191.86046511627907,"00:02:54.360",1,"PAPITO"]
["2011-02-13",200,"00:02:49.170",3,"PAPITO"]
["2011-02-13",198.79518072289156,"00:02:47.310",2,"PAPITO"]
["2011-02-13",184.35754189944134,"00:03:01.250",1,"PAPITO"]
["2011-02-11",188.57142857142856,"00:02:56.500",2,"PAPITO"]
["2011-02-11",184.35754189944134,"00:03:00.680",2,"PAPITO"]
["2011-02-11",190.75144508670522,"00:02:54.250",1,"PAPITO"]
["2011-02-11",191.86046511627907,"00:02:53.700",1,"practico papa"]
["2011-02-10",222.97297297297297,"00:02:29.620",4,"practico papa"]
["2011-02-10",198.79518072289156,"00:02:47.240",5,"practico papa"]
["2011-02-10",185.3932584269663,"00:02:59.910",2,"practico papa"]
["2011-02-10",198.79518072289156,"00:02:47.080",1,"practico papa"]
["2011-02-10",183.33333333333331,"00:03:00.870",1,"practico papa"]
["2011-02-09",203.7037037037037,"00:02:43.370",5,"practico papa"]
["2011-02-09",211.53846153846155,"00:02:37.170",4,"practico papa"]
["2011-02-09",215.68627450980392,"00:02:34.730",3,"practico papa"]
["2011-02-09",195.26627218934914,"00:02:50.330",2,"practico papa"]
["2011-02-09",183.33333333333331,"00:03:01.580",1,"practico papa"]
["2011-02-08",187.5,"00:02:57.280",2,"PAPI"]
["2011-02-08",176.47058823529414,"00:03:08.090",2,"PAPI"]
["2011-02-08",198.79518072289156,"00:02:48.080",1,"PAPI"]
["2011-02-08",201.21951219512195,"00:02:45.420",5,"PAPI"]
["2011-02-08",212.90322580645162,"00:02:37.210",4,"PAPI"]
["2011-02-08",217.10526315789474,"00:02:33.050",3,"PAPI"]
["2011-02-08",186.4406779661017,"00:02:58.600",2,"PAPI"]
["2011-02-08",195.26627218934914,"00:02:49.530",1,"PAPI"]
["2011-02-08",179.34782608695653,"00:03:05.170",1,"PAPI"]
["2011-02-07",191.86046511627907,"00:02:53.310",5,"PAPI"]
["2011-02-07",210.19108280254778,"00:02:38.820",4,"PAPI"]
["2011-02-07",201.21951219512195,"00:02:44.660",3,"PAPI"]
["2011-02-07",190.75144508670522,"00:02:54.570",2,"PAPI"]
["2011-02-07",200,"00:02:46.240",1,"PAPI"]
["2011-02-07",176.47058823529414,"00:03:08.650",1,"PAPI"]
["2011-02-06",84.615384615384627,"00:06:32.850",2,"maria magdalena"]
["2011-02-06",179.34782608695653,"00:03:05.360",1,"maria magdalena"]
["2011-02-06",110,"00:05:07.190",1,"maria magdalena"]
["2011-02-06",110.73825503355704,"00:04:59.940",1,"maria magdalena"]
["2011-02-05",173.68421052631581,"00:03:11.520",1,"YOMISMO"]
["2011-02-05",181.31868131868131,"00:03:03.890",1,"YOMISMO"]
["2011-02-05",187.5,"00:02:56.470",1,"YOMISMO"]
["2011-02-05",160.19417475728156,"00:03:26.990",1,"YOMISMO"]
["2011-02-04",196.42857142857142,"00:02:49.750",5,"YOMISMO"]
["2011-02-04",203.7037037037037,"00:02:43.280",4,"YOMISMO"]
["2011-02-04",201.21951219512195,"00:02:45.260",3,"YOMISMO"]
["2011-02-04",185.3932584269663,"00:03:01.550",2,"YOMISMO"]
["2011-02-04",180.32786885245901,"00:03:04.830",1,"YOMISMO"]
["2011-02-04",179.34782608695653,"00:03:04.810",1,"YOMISMO"]
["2011-02-04",178.37837837837836,"00:03:06.610",1,"YOMISMO"]
["2011-02-03",189.65517241379311,"00:02:55.480",5,"YOMISMO"]
["2011-02-03",197.60479041916167,"00:02:48.490",4,"YOMISMO"]
["2011-02-03",203.7037037037037,"00:02:42.590",3,"YOMISMO"]
["2011-02-03",181.31868131868131,"00:03:02.820",2,"YOMISMO"]
["2011-02-03",188.57142857142856,"00:02:57.430",1,"YOMISMO"]
["2011-02-03",190.75144508670522,"00:03:24.830",1,"YOMISMO"]
["2011-02-03",192.98245614035088,"00:02:52.220",5,"YOMISMO"]
["2011-02-03",232.3943661971831,"00:02:23.380",4,"YOMISMO"]
["2011-02-03",186.4406779661017,"00:02:57.920",2,"YOMISMO"]
["2011-01-31",198.79518072289156,"00:02:47.220",5,"YOMISMO"]
["2011-01-31",200,"00:02:46.470",4,"YOMISMO"]
["2011-01-31",177.41935483870969,"00:03:07.480",5,"YOMISMO"]
["2011-01-31",171.875,"00:03:12.820",2,"YOMISMO"]
["2011-01-31",170.10309278350516,"00:03:16.060",1,"YOMISMO"]
["2011-01-30",192.98245614035088,"00:02:52.550",3,"YOMISMO"]
["2011-01-30",163.36633663366337,"00:03:22.900",2,"YOMISMO"]
["2011-01-30",191.86046511627907,"00:02:52.830",1,"YOMISMO"]
["2011-01-30",195.26627218934914,"00:02:51.110",4,"YOMISMO"]
["2011-01-30",165.82914572864323,"00:03:20.680",2,"YOMISMO"]
["2011-01-30",190.75144508670522,"00:02:55.990",1,"YOMISMO"]
["2011-01-29",171.875,"00:03:13.210",2,"YOMISMO"]
["2011-01-29",195.26627218934914,"00:02:50.050",5,"YOMISMO"]
["2011-01-29",197.60479041916167,"00:02:48.310",3,"YOMISMO"]
["2011-01-29",184.35754189944134,"00:03:00.260",2,"YOMISMO"]
["2011-01-29",203.7037037037037,"00:02:43.750",1,"YOMISMO"]
["2011-01-29",196.42857142857142,"00:02:49.250",5,"papi"]
["2011-01-29",197.60479041916167,"00:02:48.570",4,"papi"]
["2011-01-29",190.75144508670522,"00:02:54.350",3,"papi"]
["2011-01-29",170.9844559585492,"00:03:14.540",2,"PAPA"]
["2011-01-29",180.32786885245901,"00:03:04.310",1,"PAPA"]

{"sheet":"lec.03","index":4,"n_rows":24,"n_cols":3,"rows_kept":24,"cut":false,"hidden":true,"merged":[]}
[1,"leña fea lisa deidad gelida seda jefe fila sida dias fije siglas del",3]
[2,"desde les se lea esa ese he ellas ideas sea diseñe llega si la le el es fe",3]
[3,"la le el es fe la le el es dieses fieles dieses fieles dieses fieles hiedes",3]
[4,"fijese hiedes fijese hiedes fijese leña fea lisa deidad gelida jefe fila",3]
[5,"del desde les se lea esa ese ellas ideas si diseses fieles dieses fieles",3]
[6,"dieses dia liase desele liase sida dias fije siglas sea diseñe llega gases",3]
[7,"silla sella lagaña alaska iglesias flageladas hallase seda si ese jefe",3]
[8,"ideas sida dias fijes deidad del desde",3]
[9,"STOP",3]
[10]
[11]
[12]
[13]
[14]
[15]
[16]
[17]
[18]
[19]
[20]
[21]
[22]
[23]
[24]

{"sheet":"lec.04","index":5,"n_rows":26,"n_cols":3,"rows_kept":26,"cut":false,"hidden":true,"merged":[]}
[1,"ñu regulares lugar usarse seguridad asegurar sugiere fuera guardar sufre",4]
[2,"usara lugar figura usarla igual sigue su lugar duda fue use usada aliñar",4]
[3,"leer serie realidad darse darse era red leer usara lugar serie ir sufre",4]
[4,"realidad darse fijarse guardar agregar era idear darles reglas heredar",4]
[5,"heredarla agregarle figura agregarla usarla llegar regulares lugar usarse",4]
[6,"seguridad asegurar sugiere fuera guardar sufre usara lugar figura usarla",4]
[7,"igual sigue su lugar duda fue use usada realidad darse fijarse guardar",4]
[8,"agregar era idear darles reglas heredar uiea frase",4]
[9,"STOP",4]
[10]
[11]
[12]
[13]
[14]
[15]
[16]
[17]
[18]
[19]
[20]
[21]
[22]
[23]
[24]
[25]
[26]

{"sheet":"lec.05","index":6,"n_rows":45,"n_cols":3,"rows_kept":45,"cut":false,"hidden":true,"merged":[]}
[1,"ñoño ñoña españa que dedo porque pequeños quiero aquellos por pero paso",5]
[2,"propios apropiados esperado operador pasarlo podido propiedad perforadas",5]
[3,"pode preferido poseer puro pero paso propios apropiado esperado operador",5]
[4,"pasarlo podido propiedad perforadas pode propiedades pequeño poderles",5]
[5,"porque pop preferido poseer puro porque pasa por españa que dedo porque",5]
[6,"pequeños quiero aquellos por pero paso propios apropiado esperado operador",5]
[7,"pasarlo apropiado para querer ha sido operado del ojo porque es parado del",5]
[8,"poder que quiere prefiere dar que apropiarse del",5]
[9,"STOP",5]
[10]
[11]
[12]
[13]
[14]
[15]
[16]
[17]
[18]
[19]
[20]
[21]
[22]
[23]
[24]
[25]
[26]
[27]
[28]
[29]
[30]
[31]
[32]
[33]
[34]
[35]
[36]
[37]
[38]
[39]
[40]
[41]
[42]
[43]
[44]
[45]