{"text_format":"1","workbook":"xlsx","n_sheets":3,"sheets":["apuntes","ESCRITURA","repaso"],"not_rendered":{"charts":0,"images":3,"macros":1,"external_links":0,"defined_names":0,"comments":0,"pivot_tables":0},"unopened":[],"bounds":{"document_bytes":16777216,"sheet_cells":100000,"rows_first":2000,"rows_last":500,"rows_between":2000,"halvings":0,"cell_chars":16384,"cell_head_chars":4096},"cells_cut":0,"cells_raw":0,"read":"whole","date_system":"1900"}

{"sheet":"apuntes","index":0,"n_rows":1337,"n_cols":4,"rows_kept":1337,"cut":false,"hidden":true,"merged":[]}
[1,"comieron sopa pescado huevos y postre","comieron sopa, pescado, huevos y postre"]
[{"$f":"A1+1","v":2},"aun no he comido","aún no he comido","lleva acento cuando puede substituirse por (todavía)"]
[{"$f":"A2+1","v":3},"aun los tontos lo comprenden","aun los tontos lo comprenden","no se acentúa cuando no puede substituirse por todavía"]
[4,"solo aguardo el aviso","sólo aguardo el aviso","puede acentuarse cuando es adverbio y equivale a solamente o únicamente"]
[5,"canto un solo","cantó un solo","no se acentúa cuando es nombre o adjetivo (sin compañía)"]
[6,"llego solo","llegó solo","no se acentúa cuando es nombre o adjetivo (sin compañía)"]
[7,"un solo aparato regreso","un sólo aparato regresó","puede acentuarse cuando es adverbio y equivale a solamente o únicamente"]
[8,"quiero mas carbon","quiero más carbón"]
[9,"el mas y el menos","el más y el menos"]
[10,"dame esto más no aquello","dame esto mas no aquello","no se acentúa cuando es conjunción. En tal caso puede substituirse por (pero)"]
[11,"ha venido el pero no ella","ha venido él pero no ella","se acentúa cuando es pronombre personal, o sea, cuando substituye al nombre"]
[12,"el nos lo dijo","él nos lo dijo"]
[13,"el niño cogio el libro y lo entrego a el","el niño cogió el libro y lo entregó a él","se acentúa cuando es pronombre personal, o sea, cuando substituye al nombre"]
[14,"el lo recogio y lo guardo para entregarlo a su padre","él lo recogió y lo guardó para entregarlo a su padre"]
[15,"tu no sabes la alegria que le dio al recibir este obsequio tan hermoso de mi hijo Mario","tú no sabes la alegría que le dio al recibir este obsequio tan hermoso de mi hijo Mario"]
[16,"mi buena hermana compro para mi la entrada del cine que debia ser para ella","mi buena hermana compró para mí la entrada del cine que debía ser para ella"]
[17,"estos se llevaron todas las plumas","éstos se llevaron todas las plumas"]
[18,"solo leo cuando voy a dormir","sólo leo cuando voy a dormir"]
[19,"oi un solo que solo puede tocarlo ese magnifico violinista","oí un solo que sólo puede tocarlo ese magnífico violinista","unicamente"]
[20,"fui a pasear con el","fui a pasear con él"]
[21,"le parecia ridiculo el acerlo","le parecía ridículo el hacerlo"]
[22,"no de mas caramelos a los niños","no dé más caramelos a los niños","lleva acento cuando es adverbio de cantidad o comparación o nombre"]
[23,"pues se que les perjudican","pues sé que les perjudican"]
[24,"comeis y cantais","coméis y cantáis"]
[25,"si vas a Avila podras admirar sus ermosos monumentos","si vas a Ávila podrás admirar sus hermosos monumentos"]
[26,"tu deberias preparar el te","tú deberías preparar el té"]
[27,"aun no he visto aquello","aún no he visto aquello","todavia"]
[28,"aun podremos solucionarlo","aún podremos solucionarlo","todavía"]
[29,"deseo aun mas libros para leer","deseo aún más libros para leer","todavía cantidad"]
[30,"Pedro desea aun comprar mas libros","Pedro desea aún comprar más libros","todavía"]
[31,"solo he salido para eso","sólo he salido para eso","lleva acento cuando puede substituirse por (unicamente)"]
[32,"todo lo demas aun no me interesa","todo lo demás aún no me interesa","puede sustituirse por (todavía)"]
[33,"el porque de lo sucedido no puedo saberlo hoy","el porqué de lo sucedido no puedo saberlo hoy"]
[34,"devolvi a don Hilario los seis duros que me presto","devolví a don Hilario los seis duros que me prestó"]
[35,"lograndose conjuntos muy armonicos","lográndose conjuntos muy armónicos"]
[36,"lo mio lo tuyo y lo de el todo lo quiere para si","lo mio, lo tuyo y lo de él, todo lo quiere para sí"]
[37,"¿ donde esta el vestido ?","¿ dónde está el vestido ?"]
[38,"debeis estudiar mas si quereis aprobar en junio proximo","debéis estudiar más si queréis aprobar en junio próximo"]
[39,"no se quien a podido decir semejante cosa","no sé quien ha podido decir semejante cosa"]
[40,"¿ no as comprendido aun que es necio servir al que paga mal ?","¿ no has comprendido aún que es necio servir al que paga mal ?"]
[41,"abitualmente resido en Alava","habitualmente resido en Álava"]
[42,"esto no es para mi, pero aquello si lo es","esto no es para mí, pero aquello sí lo es"]
[43,"se bueno, y tendras tu reconpensa","sé bueno, y tendrás tu recompensa"]
[44,"yo no se lo que quiere decir","yo no sé lo que quiere decir","lleva acento cuando es verbo (ser o saber)"]
[45,"se estudiosa","sé estudiosa","lleva acento cuando es verbo (ser o saber)"]
[46,"ella se puso a estudiar y se entusiasmo","ella se puso a estudiar y se entusiasmó","no lleva acento cuando es pronombre"]
[47,"no se escribieron mas","no se escribieron más"]
[48,"lleva un saco acuestas","lleva un saco a cuestas","modo de llevar algo"]
[49,"te a cuestas tarde","te acuestas tarde","verbo acostarse"]
[50,"se irio asimismo","se hirió a sí mismo","a su propia persona"]
[51,"ellos llegaran, a si mismo, a las doce","ellos llegarán, asimismo, a las doce","también, del mismo modo, de igual manera"]
[52,"asi mismo esta bien","así mismo está bien","de esta manera"]
[53,"llegue a un pueblo","llegué a un pueblo"]
[54,"No a llegado aun","No ha llegado aún"]
[55,"vinieron todos, aún los ancianos","vinieron todos, aun los ancianos","también hasta"]
[56,"es del verbo aber","es del verbo haber"]
[57,"abiendo tanto no faltara","habiendo tanto no faltará"]
[58,"no a abido lugar a ello","no ha habido lugar a ello"]
[59,"con aber abido tanto no a sido suficiente","con haber habido tanto no ha sido suficiente"]
[60,"no a abido lugar a ello","no ha habido lugar a ello"]
[61,"abiendo de ver luego el partido, no salgamos aora","habiendo de ver luego el partido, no salgamos ahora"]
[62,"voy a ver a mi ermana","voy a ver a mi hermana"]
[63,"e de ver si esta el verbo aber","he de ver si está el verbo haber"]
[64,"a ver si vienes","a ver si vienes"," a no lleva H cuando es preposición, voy a pasear, he ido a saltar, voy a casa"]
[65,"ve a ver si esta en casa","ve a ver si está en casa"," a no lleva H cuando es preposición, voy a pasear, he ido a saltar, voy a casa"]
[66,"yo e comido tanto que me a echo daño","yo he comido tanto que me ha hecho daño"]
[{"$f":"A66+1","v":67},"as de saber, amigo Vicente, que emos andado toda la jornada","has de saber, amigo Vicente, que hemos andado toda la jornada"]
[68,"vosotros abreis de ir como lo an echo ellos","vosotros habréis de ir como lo han hecho ellos"]
[69,"a abido una discusion y no as de preguntar nada","ha habido una discusión y no has de preguntar nada"]
[70,"an de aber cantado muy fuerte","han de haber cantado muy fuerte"]
[71,"no abia nada cuando tu abias regresado","no había nada cuando tú habías regresado"]
[72,"¿ te gustaria tomar el te en aquel parador tan magnifico que ay en las cercanias de Tuy ?","¿ te gustaría tomar el té en aquel parador tan magnífico que hay en las cercanías de Tuy ?"]
[73,"aun no a traido la maquina que dijeron traerian ayer","aún no ha traído la máquina que dijeron traerían ayer"]
[74,"mas el director a dicho que el se encargara personalmente del asunto","mas el director ha dicho que él se encargará personalmente del asunto"]
[75,"y confia que hoy quedara lista","y confía que hoy quedará lista"]
[76,"es el verbo aber","es el verbo haber"]
[77,"abiendo tanto no faltara","habiendo tanto no faltará"]
[78,"con aber abido tanto no a sido suficiente","con haber habido tanto no ha sido suficiente"]
[79,"buscalo ai","búscalo ahí","adverbio de lugar"]
[80,"por aí lo encontraras","por ahí lo encontrarás","adverbio de lugar"]
[81,"ay mucha gente","hay mucha gente","verbo haber"]
[82,"ay ahí un ombre que dice ai","ahí hay un hombre que dice ay"]
[83,"no ay nada que acer aqui","no hay nada que hacer aquí"]
[84,"abitantes","habitantes"]
[85,"a estallado una uelga inponente","ha estallado una huelga imponente","antes de b y p m pondré"]
[86,"el uerfano a pasado la noche en el uerto","el huerfano ha pasado la noche en el huerto","ha verbo  se puedea pasar al plural (han)"]
[87,"con sus erramientas izo un erraje muy solido","con sus herramientas hizo un herraje muy sólido"]
[88,"el campo estaba muy ermoso","el campo estaba muy hermoso"]
[89,"la erencia que eredo el eredero menor tiene catorce ectareas de uerta","la herencia que heredó el heredero menor tiene catorce hectáreas de huerta"]
[90,"con la navaja se izo un erida muy onda","con la navaja se hizo una herida muy honda"]
[91,"estas plantas erbaceas ermosearon nuestro jardin","estas plantas herbaceas hermosearon nuestro jardín"]
[92,"el encontro un erizo entre las ierbas","él encontró un erizo entre las hierbas","él (pronombre personal sustituye el nombre)"]
[93,"Ipolito decia que su ermano era mas abil","Hipólito decía que su hermano era más hábil"]
[94,"al cirujano especialista en operar ernias se le llama ernista","al cirujano especialista en operar hernias se le llama hernista"]
[95,"azlo breve y sin cometer ningun error","hazlo breve y sin cometer ningún error"]
[96,"abichuela","habichuela"]
[97,"la uerta se alla ermosa","la huerta se halla hermosa"]
[98,"seguimos las uellas y llegamos asta la entrada de la cueva","seguimos las huellas y llegamos hasta la entrada de la cueva"]
[99,"abia montones de uesos","había montones de huesos"]
[100,"lleva un saco acuestas","lleva un saco a cuestas","modo de llevar algo (a cuestas)"]
[101,"te a cuestas tarde","te acuestas tarde","del verbo acostarse (acuestas)"]
[102,"se irio a si mismo","se hirió a sí mismo","a su propia persona"]
[103,"ellos llegaran, asi mismo, a las doce","ellos llegarán, asimismo, a las doce","también,del mismo modo,de igual manera"]
[104,"asi mismo esta bien","así mismo está bien","de esta manera"]
[105,"llegue a un pueblo","llegué a un pueblo","preposición y artículo"]
[106,"no a llegado aun","no ha llegado aún","todavía (no ha llegado dodavía)"]
[107,"vinieron todos, aun los ancianos","vinieron todos, aun los ancianos","también,hasta"]
[108,"el pelo de Luis es mas corto aun que el de Juan","el pelo de Luis es más corto aún que el de Juan","para realizar conparaciones"]
[109,"aunque no a llegado,comenzaremos","aunque no ha llegado, comenzaremos","a pesar de que (a pesar de que no ha llegado, comenzaremos)"]
[110,"ese adjetivo esta de mas","ese adjetivo está de más","de sobra"]
[111,"le tengo dicho que no le de mas caramelos","le tengo dicho que no le dé más caramelos","del verbo dar"]
[112,"los demas no cantaban","los demás no cantaban","adverbio"]
[113,"entre tanto papel, no me aclaro","entre tanto papel, no me aclaro","entre muchos"]
[114,"entre tanto lo desembalan, desallunaremos","entretanto lo desembalan, desayunaremos","mientras (mientras lo desembalan)"]
[115,"desenbalan","desembalan","antes de b y p  (m) pondré"]
[116,"el codigo porque se rije la comunidad es reciente","el código por que se rige la comunidad es reciente","por el cual,     por la cual ( el código por la cual se rige)"]
[117,"lloraba por qué estava triste","lloraba porque estaba triste","a causa de (lloraba a causa de que estaba triste)"]
[118,"el sabe por que lo a echo","él sabe por qué lo ha hecho","por un motivo concreto (él sabe el motivo)"]
[119,"el jersey esta echo de lana","el jersey está hecho de lana","hecho de hacer,  echo   de echar"]
[120,"no conosco el por que de este informe","no conozco el porqué de este informe","motivo, causa o razón"]
[121,"tanto que hacer me abruma","tanto quehacer me abruma","tarea (que hacer) pronimbre indefinido y verbo hacer"]
[122,"el negocio salio tanbien que repetimos","el negocio salió tan bien que repetimos","en sentido comparativo"]
[123,"el telegrama tanbien a salido hoy","el telegrama también ha salido hoy","adverbio"]
[124,"llueve tanpoco que todo esta seco","llueve tan poco que todo está seco","en sentido comparativo"]
[125,"Luisa tan poco a llamado","Luisa tampoco ha llamado","adverbio"]
[126,"tanpoco","tampoco","antes de b y p  (m) pondré"]
[127,"la aldea a donde vamos no tiene luz","la aldea adonde vamos no tiene luz","al lugar que...( la aldea al lugar que vamos...)"]
[128,"¿ adonde iremos el lunes?","¿ adónde iremos el lunes ?","¿a qué lugar? En interrogación"]
[129,"tenia una erida por asta de toro","tenía una herida por asta de toro","(asta de toro)  hasta preposición  llegaron hasta la cumbre"]
[130,"llegaron asta la cumbre","llegaron hasta la cumbre","preposición ( asta de toro)"]
[{"$f":"A130+1","v":131},"llegaron todos los paquetes, aun los mas grandes","llegaron todos los paquetes, aun los más grandes","hasta, también (hasta los más grandes) (también los más grandes)"]
[132,"aun estamos en Madrid","aún estamos en Madrid","todavía (todavía estemos en Madrid)"]
[133,"pondremos el equipaje en la vaca","pondremos el equipaje en la baca","baca del autómovil ( la vaca da leche)"]
[134,"ese mueble no cabe en la abitacion","ese mueble no cabe en la habitación","(cabe) del verbo caber (cave) del vervo cavar"]
[135,"el mes de enero","el mes de enero","(de) preposición (dé) del verbo dar"]
[136,"dile a Ricardo que de la calefaccion","dile a Ricardo que dé la calefacción","(dé) del verbo dar"]
[137,"el Viejo y el Mar","el Viejo y el Mar","(el) artículo"]
[138,"no se lo entreges a el","no se lo entregues a él","(él) Pronombre personal"]
[139,"el fue el que lo hizo","él fue el que lo hizo","(él) sustituye al nombre  (el) artículo"]
[140,"este armario necesita pintarse","este armario necesita pintarse","adjetivo demostrativo (este ese aquel etc.)"]
[141,"esta abitacion es luminosa","esta habitación es luminosa","adjetivo demostrativo (este ese aquel etc.)"]
[142,"la maquina numero tres es nueva; esta habria que repararla","La máquina número tres es nueva; ésta habría que repararla","(ésta) pronombre demostrativo   (ésta, ésa, aquélla etc.)"]
[143,"ese panel esta torcido","ese panel está torcido","adjetivo demostrativo"]
[144,"la cartera marron es de Jacinto; esa de Miguel","la cartera marrón es de Jacinto; esa de Miguel","(ésa) pronombre demostrativo"]
[145,"me mandaron un sobre, mas no lo recibi","me mandaron un sobre, mas no lo recibí","(mas) pero (pero no lo recibí)"]
[146,"no envies mas bultos","no envíes más bultos","(más) cantidad  (más bultos)"]
[147,"mi ermano es menor que yo","mi hermano es menor que yo","(mi) posesivo, admite cambios al plural (mis hermanos)"]
[148,"debes contarmelo a mi","debes contármelo a mí","(mi) pronombre personal ( no admite plural)"]
[149,"se dice que no llegaremos a tiempo","se dice que no llegaremos a tiempo","(se) en frase de tono impersonal"]
[150,"lo que me preguntas no lo se","lo que me preguntas no lo sé","(sé) verbo saber y ser"]
[151,"se una buena persona","sé una buena persona","(sé) verbo saber y ser"]
[152,"desconozco si lo han mandado","desconozco si lo han mandado","(si) para expresar una condición o duda"]
[153,"si lo deseas, lo consegiras","si lo deseas, lo conseguirás","(si) para expresar una condición o duda"]
[154,"dijo que si lo haria","dijo que sí lo haría","(sí) afiramción, pronombre personal"]
[155,"ablaba para si mismo","hablaba para sí mismo","(sí) afiramción, pronombre personal"]
[156,"habia un solo violin en la orquesta","había un solo violín en la orquesta","(solo) único sin compañia"]
[157,"el banco estava solo, nadie lo ocupaba","el banco estaba solo, nadie lo ocupaba","(solo) único sin compañia"]
[158,"te digo solo una cosa","te digo sólo una cosa","(sólo) solamente unicamente (te digo solamente una cosa)"]
[159,"tu pueblo es muy grande","tu pueblo es muy grande","(tu) posesivo (tú) pronobre personal (tú lo has querido así"]
[160,"tu lo as querido asi","tú lo has querido así","(tú) pronombre personal  (referiéndose a él)"]
[161,"el tubo de escape se rompio","el tubo de escape se rompió","(tubo) pieza cilíndrica hueca"]
[162,"la empresa tubo muchos problemas","la empresa tuvo muchos problemas","(tuvo) del verbo tener"]
[163,"arbol","árbol"]
[164,"caracteristico","característico"]
[165,"cranero","cráneo"]
[166,"estabamos","estábamos"]
[167,"contabamos","contábamos"]
[168,"el general animo a sus tropas dandoles animo","el general animó a sus tropas dándoles ánimo"]
[169,"recomendaras al interprete que interprete bien la conferencia","recomendarás intérprete"]
[170,"da lastima ver como se lastima el trabajador en la fundiccion","da lástima ver como se lastíma el trabajador en la fundición"]
[171,"el mecanico a reparado la dinamo","el mecánico ha  reparado la dinamo"]
[172,"en estos arboles","en estos árboles"]
[173,"aun no he comido","aún no he comido","no se acentúa cuando puede sustituirse por (todavía ,hasta, también o inclusive) todavía no he comido"]
[174,"quiero mas carbon","quiero más carbón","lleva acento cuando es adverbio de cantidad o comparación o nombre el más y el menos"]
[175,"dame esto más no aquello","dame esto mas no aquello","no se acentúa cuando es conjunción. En  tal cso puede substituirse por (pero) dame esto pero no aquello"]
[176,"a venido el pero no ella","ha venido él pero no ella","se acentúa cuando es pronombre personal, o sea, cuando substituye al nombre"]
[177,"el nos lo dijo","él nos lo dijo","se acentúa cuando es pronombre personal, o sea, cuando substituye al nombre"]
[178,"toma el jugete y el lapiz","toma el juguete y el lápiz","no se acentúa cuando es artículo, o sea cuando acompaña al nombre"]
[179,"tu no puedes resolver el poblema","tú no puedes resolver el problema","se acentúa cuando es pronombre personal, o sea cuando acompaña al nombre"]
[180,"tu caza tiene seis pisos","tu casa tiene seis pisos","(tu) no se acentúa cuando es adjetivo posesivo y, por lo tanto, acompaña al nombre"]
[181,"esto es para mi y no para ti","esto es para mí y no para ti","(mi) se acentúa cuando es pronombre (ti) no se acentúa nunca"]
[182,"ven luego a mí casa","ven luego a mi casa","no se acentúa cuando es adjetivo posesivo o nota musical"]
[183,"esta nota se llama mí","esta nota se llama mi","no se acentúa cuando es adjetivo posesivo o nota musical"]
[184,"me lo dijo este","me lo dijo éste","se acentúan normalmente cuando son pronombres demostrativos,o sea, cuando sustituyen al nombre"]
[185,"aquel que vino es mi ermano","aquel que vino es mi hermano","no se acentúa cuando el pronombre puede substituirse por el artículo (el) (la)"]
[186,"aquella ultima es mi prima","aquella última es mi prima","no se acentúa cuando el pronombre puede substituirse por el artículo (el) (la) (las)"]
[187,"aquellos que sepan la leccion tendran un premio","aquellos que sepan la lección tendrán un premio","no se acentúa cuando el pronombre puede substituirse por el artículo (el) (la) (las) (los)"]
[188,"este de oy no me gusta","éste de hoy no me gusta","no se acentúa cuando el pronombre puede substituirse por el artículo (el) (la) (las) (los)"]
[189,"subtituirse","substituirse"]
[190,"este libro, ese lapiz y aquellos relojes son mios","este libro, ese lápiz y aquellos relojes son mios","(este) no lleva acento cuando son adjetivos demostrativos, o sea cuando acompañan al nombre"]
[191,"dame estos papeles","dame estos papeles","(estos) no lleva acento cuando son adjetivos demostrativos, o sea cuando acompañan al nombre"]
[192,"toma aquellas carpetas","toma aquellas carpetas","(aquellas) no lleva acento cuando son adjetivos demostrativos, o sea cuando acompañan al nombre"]
[193,"esto es mio","esto es mio","esto, eso y aquello no se acentúa"]
[194,"acentua","acentúa"]
[{"$f":"A194+1","v":195},"yo no se lo que quieres decir","yo no sé lo que quieres decir","(sé) lleva acento cuando es verbo ( ser o saber )"]
[196,"se estudiosa","sé estudiosa","(sé) lleva acento cuando es verbo ( ser o saber )"]
[197,"ella se puso a estudiar y se entusiasmo","ella se puso ha estudiar y se entusiasmó","(se) no lleva acento cuando es pronombre"]
[198,"no se inscribieron mas","no se inscribieron más","(se) no lleva acento cuando es pronombre"]
[199,"no se como an podido realizar esto","no sé como han podido realizar esto","(sé) lleva acento cuando es verbo ( ser o saber )"]
[200,"se bueno y obtendras lo que deseas","sé bueno y obtendrás lo que deseas","(sé) lleva acento cuando es verbo ( ser o saber )"]
{"$rows_left_out":1138}
{"sheet":"ESCRITURA","index":1,"n_rows":15,"n_cols":24,"rows_kept":15,"cut":false,"hidden":false,"merged":[[15,0,21,22],[11,21,14,22],[8,9,8,14],[23,18,24,19],[23,1,24,2],[22,7,22,16],[22,18,22,19],[22,1,22,2],[14,0,14,1],[4,0,4,22],[3,0,3,22],[8,19,8,21],[9,0,10,20],[5,0,6,22],[7,0,7,22],[0,13,0,17],[0,9,0,12],[0,0,0,8],[2,0,2,22],[1,0,1,23]]}
[null,null,null,null,null,null,null,null,null,"habilitar este contenido",null,null,null,"junio del 2010 por joannostro"]
[{"$f":"VLOOKUP(W10,apuntes!A1:D999,4,FALSE)","v":"lleva acento cuando es verbo (ser o saber)"}]
[{"$f":"VLOOKUP(W10,apuntes!A1:D999,3,FALSE)","v":"yo no sé lo que quiere decir"}]
[]
[]
[{"$f":"VLOOKUP(W10,apuntes!A1:D999,2,FALSE)","v":"yo no se lo que quiere decir"}]
[]
[null,null,null,null,null,null,null,null,null,null,null,null,null,null,null,null,null,null,null,null,null,null,null,"u"]
[null,null,null,null,null,null,null,null,null,"celda escritura",null,null,null,null,null,null,null,null,null,null,null,null,{"$f":"RANDBETWEEN(1,235)","v":208}]
[null,null,null,null,null,null,null,null,null,null,null,null,null,null,null,null,null,null,null,null,null,null,44]
[]
[]
[]
[]
["respuesta"]

{"sheet":"repaso","index":2,"n_rows":15,"n_cols":24,"rows_kept":15,"cut":false,"hidden":true,"merged":[[23,1,24,2],[23,18,24,19],[14,0,14,1],[15,0,21,22],[22,1,22,2],[22,7,22,16],[22,18,22,19],[9,0,10,20],[0,0,0,8],[0,9,0,12],[0,13,0,17],[1,0,1,23],[2,0,2,22],[3,0,3,22],[4,0,4,22],[5,0,6,22],[7,0,7,22],[8,9,8,14],[8,19,8,21]]}
["http://usuarios.multimania.es/joannostro",null,null,null,null,null,null,null,null,"habilitar este contenido",null,null,null,"junio del 2010 por joannostro",null,null,null,null,null,"http://sonyo.iespana.es"]
[{"$f":"VLOOKUP(V11,apuntes!A1:D999,4,FALSE)","v":"(con qué ) se escribe separado y con acento cuando está en sentido ¿? ¡! O enfático"}]
[{"$f":"VLOOKUP(V11,apuntes!A1:D999,3,FALSE)","v":"dime con qué has hecho esto"}]
["escribe los fallos de escritura o completar palabra"]
[]
[{"$f":"VLOOKUP(V11,apuntes!A1:D235,2,FALSE)","v":"dime con que as echo esto"}]
[]
[null,null,null,null,null,null,null,null,null,null,null,null,null,null,null,null,null,null,null,null,null,null,null,"u"]
[null,null,null,null,null,null,null,null,null,"celda escritura",null,null,null,null,null,null,null,null,null,null,null,null,{"$f":"RANDBETWEEN(1,235)","v":73}]
[null,null,null,null,null,null,null,null,null,null,null,null,null,null,null,null,null,null,null,null,null,null,165]
[null,null,null,null,null,null,null,null,null,null,null,null,null,null,null,null,null,null,null,null,null,233]
[null,null,null,null,null,null,null,null,null,null,null,null,null,null,null,null,null,null,null,null,null,1]
[]
[]
["respuesta"]