{"text_format":"1","workbook":"xlsx","n_sheets":3,"sheets":["LISTA","Hoja2","Hoja3"],"not_rendered":{"charts":0,"images":0,"macros":1,"external_links":0,"defined_names":0,"comments":0,"pivot_tables":0},"unopened":[],"bounds":{"document_bytes":16777216,"sheet_cells":100000,"rows_first":2000,"rows_last":500,"rows_between":2000,"halvings":0,"cell_chars":16384,"cell_head_chars":4096},"cells_cut":0,"cells_raw":0,"read":"whole","date_system":"1900"}

{"sheet":"LISTA","index":0,"n_rows":45,"n_cols":13,"rows_kept":45,"cut":false,"hidden":false,"merged":[]}
[1,"VENTANA",9212,9,2,1,2,null,null,"ve","ta","na"]
[2,"SILLA",65,6,5,null,null,null,null,"si","lla"]
[3,"SACO",64,6,4,null,null,null,null,"sa","co"]
[4,"PUERTA",901,9,0,1,null,null,null,"pu","er","ta"]
[5,"PLANCHA",9528,9,5,2,8,null,null,"pla","n","cha"]
[6,"PIEDRA",910,9,1,0,null,null,null,"pie","d","ra"]
[7,"PEZ",96,9,6,null,null,null,null,"pe","z"]
[8,"PESCADO",9641,9,6,4,1,null,null,"pe","s","ca","do"]
[9,"PERIODICO",9014,9,0,1,4,null,null,"pe","ri","odi","co"]
[10,"PERA",90,9,0,null,null,null,null,"pe","ra"]
[11,"PATATA",911,9,1,1,null,null,null,"pa","ta","ta"]
[12,"PAPEL",995,9,9,5,null,null,null,"pa","pe","l"]
[13,"NARANJA",2027,2,0,2,7,null,null,"na","ra","n","ja"]
[14,"MESA",36,3,6]
[15,"LUNA",52,5,2]
[16,"LLAVE",59,5,9]
[17,"LIMON",532,5,3,2]
[18,"LIBRO",595,5,9,5]
[19,"LAPIZ",596,5,9,6]
[20,"LAMPARA",5390,5,3,9,0]
[21,"JAMON",732,7,3,2]
[22,"HARINA","02"]
[23,"FOTO",71,7,1]
[24,"FLOR",750,7,5,0]
[25,"ESTRELLA",6105,6,1,0,5]
[26,"DISCO",164,1,6,4]
[27,"COCHE",48,4,8]
[28,"CEBOLLA",695,6,9,5]
[29,"CARRO",40,4,0]
[30,"CARRITO",401,4,0,1]
[31,"CABALLO",495,4,9,5]
[32,"BUTACA",914,9,1,4]
[33,"BOMBILLA",9395,9,3,9,5]
[34,"BLOC",954,9,5,4]
[35,"BEBE",99,9,9]
[36,"BARCA",904,9,0,4]
[37,"BALON",952,9,5,2]
[38,"ANILLO",25,2,5]
[39,"CAMISA",436,4,3,6]
[40,"BOTON",912,9,1,2]
[41,"AZUCAR",640,6,4,0]
[42,"SAL",65,6,5]
[43,"PIMIENTO",9321,9,3,2,1]
[44,"PALILLO",955,9,5,5]
[45,"CORTINA",4012,4,0,1,2]

{"sheet":"Hoja2","index":1,"n_rows":5,"n_cols":8,"rows_kept":5,"cut":false,"hidden":false,"merged":[[0,7,0,12]]}
[null,null,null,null,null,null,null,"joannostro.com"]
[]
[]
[null,null,13]
[null,{"$f":"VLOOKUP(C4,LISTA!A1:C17,2,FALSE)","v":"NARANJA"},{"$f":"RANDBETWEEN(1,16)","v":13},{"$f":"VLOOKUP(C4,LISTA!A1:C17,3,FALSE)","v":2027},null,{"$f":"D5","v":2027},{"$f":"B5","v":"NARANJA"}]

{"sheet":"Hoja3","index":2,"n_rows":0,"n_cols":0,"rows_kept":0,"cut":false,"hidden":false,"merged":[]}