{"text_format":"1","workbook":"xlsx","n_sheets":3,"sheets":["Hoja2","Hoja1","Hoja3"],"not_rendered":{"charts":0,"images":1,"macros":1,"external_links":0,"defined_names":0,"comments":0,"pivot_tables":0},"unopened":[],"bounds":{"document_bytes":16777216,"sheet_cells":100000,"rows_first":2000,"rows_last":500,"rows_between":2000,"halvings":0,"cell_chars":16384,"cell_head_chars":4096},"cells_cut":0,"cells_raw":0,"read":"whole","date_system":"1900"}

{"sheet":"Hoja2","index":0,"n_rows":1008,"n_cols":22,"rows_kept":1008,"cut":false,"hidden":true,"merged":[]}
[1,"¿En qué campo artístico destacó Giovanni Bellini ?","pintura","P","I","N","T","U","R","A",null,null,null,null,null,null,null,null,null,null,null,{"$f":"CONCATENATE(D1,E1,F1,G1,H1,I1,J1,K1,L1,M1,N1,O1,P1,Q1,R1,S1,T1,U1)","v":"PINTURA"}]
[2,"¿De qué nacionalidad era el futbolista conocido como \"la saeta rubia\"?","Argentina","A","R","G","E","N","T","I","N","A",null,null,null,null,null,null,null,null,null,{"$f":"CONCATENATE(D2,E2,F2,G2,H2,I2,J2,K2,L2,M2,N2,O2,P2,Q2,R2,S2,T2,U2)","v":"ARGENTINA"}]
[3,"¿Qué es el esternocleidomastoideo?","musculo","M","U","S","C","U","L","O",null,null,null,null,null,null,null,null,null,null,null,"MUSCULO"]
[4,"¿Cómo se denomina el coleccionista de monedas y medallas?","numismatico","N","U","M","I","S","M","A","T","I","C","O",null,null,null,null,null,null,null,"NUMISMATICO"]
[5,"¿Cómo se llamaba el locutor de radio del programa de cine polvo de estrellas?","Carlos Pomares","C","A","R","L","O","S",null,"P","O","M","A","R","E","S",null,null,null,null,"CARLOSPOMARES"]
[6,"¿Con qué otro nombre es más conocido el dios griego Heracles?","Hercules","H","E","R","C","U","L","E","S",null,null,null,null,null,null,null,null,null,null,"HERCULES"]
[7,"¿Qué nombre recibe la ciencia que trata del conocimiento de las monedas y de las medallas?","Numismtica ","N","U","M","I","S","M","A","T","I","C","A",null,null,null,null,null,null,null,"NUMISMATICA"]
[8,"¿Qué movimiento dirigió la llamada revolución de las \"flores\" llevada a cabo en mayo de 1968?","  Hippie ","H","I","P","P","I","E",null,null,null,null,null,null,null,null,null,null,null,null,"HIPPIE"]
[9,"¿Qué país contiene la mayor parte de los ríos Tigris y Éufrates?"," Irak ","I","R","A","K",null,null,null,null,null,null,null,null,null,null,null,null,null,null,"IRAK"]
[10,"¿ Cómo se llama el arte de criar, amaestrar y curar a los halcones y otras aves como el azor ?","Cetreria ","C","E","T","R","E","R","I","A",null,null,null,null,null,null,null,null,null,null,"CETRERIA"]
[11,"¿Qué actor era \"La mascara negra\" en la serie televisiva?","Sancho Gracia","S","A","N","C","H","O",null,"G","R","A","C","I","A",null,null,null,null,null,"SANCHOGRACIA"]
[12,"¿Cómo se denomina un dispositivo electrónico con dos electrodos?","Diodo","D","I","O","D","O",null,null,null,null,null,null,null,null,null,null,null,null,null,"DIODO"]
[13,"¿Qué británico dirigió La naranja mecánica en 1971?","Stanley Kubrick ","S","T","A","N","L","E","Y",null,"K","U","B","R","I","C","K",null,null,null,{"$f":"CONCATENATE(D13,E13,F13,G13,H13,I13,J13,K13,L13,M13,N13,O13,P13,Q13,R13,S13,T13,U13)","v":"STANLEYKUBRICK"}]
[14,"¿Cuál es la capital de Holanda?","La Haya","L","A",null,"H","A","Y","A",null,null,null,null,null,null,null,null,null,null,null,"LAHAYA"]
[15,"Hypertext Markup Language","HTML","H","T","M","L",null,null,null,null,null,null,null,null,null,null,null,null,null,null,"HTML"]
[16,"world wide web","www","W","W","W",null,null,null,null,null,null,null,null,null,null,null,null,null,null,null,"WWW"]
[17,"¿A cuantos bits equivale 1 byte ?","ocho","O","C","H","O",null,null,null,null,null,null,null,null,null,null,null,null,null,null,"OCHO"]
[18,"¿Como se llama al código de ceros y unos en que se basa la informática ?","lenguaje binario","L","E","N","G","U","A","J","E",null,"B","I","N","A","R","I","O",null,null,"LENGUAJEBINARIO"]
[19,"¿Cómo se llamó el primer ordenador digital totalmente electrónico?","Colossus ","C","O","L","O","S","S","U","S",null,null,null,null,null,null,null,null,null,null,"COLOSSUS"]
[20,"Cuál es el más importante de los sistemas operativos del mundo ?","MS-DOS","M","S",null,"D","O","S",null,null,null,null,null,null,null,null,null,null,null,null,"MSDOS"]
[21,"¿Cuál fue el antepasado más antiguo del ordenador ? el...","Abaco","A","B","A","C","O",null,null,null,null,null,null,null,null,null,null,null,null,null,"ABACO"]
[22,"¿Cuál fue el primer ordenador digital moderno?","Mark I","M","A","R","K","I",null,null,null,null,null,null,null,null,null,null,null,null,null,"MARKI"]
[23,"¿Qué comando se utiliza en MS-DOS para cambiar de una unidad a otra?","Cd","C","D",null,null,null,null,null,null,null,null,null,null,null,null,null,null,null,null,"CD"]
[24,"File Transfer Protocolo","FTP","F","T","P",null,null,null,null,null,null,null,null,null,null,null,null,null,null,null,"FTP"]
[25,"¿Qué significa el código 0 del lenguaje binario?","no pasa corriente","N","O",null,"P","A","S","A",null,"C","O","R","R","I","E","N","T","E",null,"NOPASACORRIENTE"]
[26,"¿Qué significa el código 1 del lenguaje binario?","pasa corriente","P","A","S","A",null,"C","O","R","R","I","E","N","T","E",null,null,null,null,"PASACORRIENTE"]
[27,"Random Access Memory","RAM","R","A","M",null,null,null,null,null,null,null,null,null,null,null,null,null,null,null,"RAM"]
[28,"Inventor de la radio","Guillermo Marconi","G","U","I","L","L","E","R","M","O",null,"M","A","R","C","O","N","I",null,"GUILLERMOMARCONI"]
[29,"Guillermo Marconi fue inventor de ? la... ","radio","R","A","D","I","O",null,null,null,null,null,null,null,null,null,null,null,null,null,"RADIO"]
[30,"Inventor del motor eléctrico","Michael Faraday","M","I","C","H","A","E","L",null,"F","A","R","A","D","A","Y",null,null,null,"MICHAELFARADAY"]
[31,"Michael Faraday inventor del","motor eléctrico","M","O","T","O","R",null,"E","L","E","C","T","R","I","C","O",null,null,null,"MOTORELECTRICO"]
[32,"la lámpara incandescente fue inventada por ?"," Thomas Edison","T","H","O","M","A","S",null,"E","D","I","S","O","N",null,null,null,null,null,"THOMASEDISON"]
[33,"¿Dónde se inventó la bicicleta?","Alemania","A","L","E","M","A","N","I","A",null,null,null,null,null,null,null,null,null,null,"ALEMANIA"]
[34,"¿En que país se descubrió el alcohol?","España","E","S","P","A","Ñ","A",null,null,null,null,null,null,null,null,null,null,null,null,"ESPAÑA"]
[35,"¿En que país se descubrió el cloroformo?","Estados Unidos","E","S","T","A","D","O","S",null,"U","N","I","D","O","S",null,null,null,null,"ESTADOSUNIDOS"]
[36,"¿En que país se inventó el abaco?","China","C","H","I","N","A",null,null,null,null,null,null,null,null,null,null,null,null,null,"CHINA"]
[37,"¿En que país se inventó el arado de acero?","Estados Unidos","E","S","T","A","D","O","S",null,"U","N","I","D","O","S",null,null,null,null,"ESTADOSUNIDOS"]
[38,"¿En que país se inventó el estetoscopio?","Francia","F","R","A","N","C","I","A",null,null,null,null,null,null,null,null,null,null,null,"FRANCIA"]
[39,"¿En que país se inventó el generador eléctrico?","Inglaterra","I","N","G","L","A","T","E","R","R","A",null,null,null,null,null,null,null,null,"INGLATERRA"]
[40,"En que país se inventó el neumático de goma?","Irlanda","I","R","L","A","N","D","A",null,null,null,null,null,null,null,null,null,null,null,"IRLANDA"]
[41,"¿En que país se inventó la caja registradora?","Estados Unidos","E","S","T","A","D","O","S",null,"U","N","I","D","O","S",null,null,null,null,"ESTADOSUNIDOS"]
[42,"¿ En que país se inventó la calculadora ?","Alemania","A","L","E","M","A","N","I","A",null,null,null,null,null,null,null,null,null,null,"ALEMANIA"]
[43,"¿En que país se inventó la cámara fotográfica?","Estados Unidos","E","S","T","A","D","O","S",null,"U","N","I","D","O","S",null,null,null,null,"ESTADOSUNIDOS"]
[44,"¿ quién marcó el gol en la final del mundial contra Holanda 2010 ?","Andrés Iniesta","A","N","D","R","E","S",null,"I","N","I","E","S","T","A",null,null,null,null,"ANDRESINIESTA"]
[45,"¿ con cuál equipo se enfrentó España en la final del mundial del 2010 ?","Holanda","H","O","L","A","N","D","A",null,null,null,null,null,null,null,null,null,null,null,"HOLANDA"]
[46,"Holanda se enfrentó en la final del mundial del 2010 contra... ?","España","E","S","P","A","Ñ","A",null,null,null,null,null,null,null,null,null,null,null,null,"ESPAÑA"]
[47,"Quienes fueron los finalistas del mundial de fútbol del 2010","España Holanda","E","S","P","A","Ñ","A",null,"H","O","L","A","N","D","A",null,null,null,null,"ESPAÑAHOLANDA"]
[48,"¿ Cómo se llamaba el derecho que se pagaba por el paso de los ganados ?","asadura","A","S","A","D","U","R","A",null,null,null,null,null,null,null,null,null,null,null,"ASADURA"]
[49,"Cuál es la cria del caballo","potro","P","O","T","R","O",null,null,null,null,null,null,null,null,null,null,null,null,null,"POTRO"]
[50,"Cómo se llama la parte trasera de un barco ?","popa","P","O","P","A",null,null,null,null,null,null,null,null,null,null,null,null,null,null,"POPA"]
[51,"cuál es el nombre actual de la antigua Persia ?","Irán","I","R","A","N",null,null,null,null,null,null,null,null,null,null,null,null,null,null,"IRAN"]
[52,"cómo se llama a un grupo de cerdos","piara","P","I","A","R","A",null,null,null,null,null,null,null,null,null,null,null,null,null,"PIARA"]
[53,"qué hay que añadir a la bechamel para que espese","harina","H","A","R","I","N","A",null,null,null,null,null,null,null,null,null,null,null,null,"HARINA"]
[54,"Cómo se llama cada una de las piezas que componen un mosaico","tesela","T","E","S","E","L","A",null,null,null,null,null,null,null,null,null,null,null,null,"TESELA"]
[55,"En qué programa de televisión apareció Carmén Sevilla como presentadora","en tele cupón","T","E","L","E",null,"C","U","P","O","N",null,null,null,null,null,null,null,null,"TELECUPON"]
[56,"Cuál es el país en el que hay mayor número de conejos","Australia","A","U","S","T","R","A","L","I","A",null,null,null,null,null,null,null,null,null,"AUSTRALIA"]
[57,"Qué es el cártamo","un cardo","C","A","R","D","O",null,null,null,null,null,null,null,null,null,null,null,null,null,"CARDO"]
[58,"En dónde pagarías con cruzeiros","Brasil","B","R","A","S","I","L",null,null,null,null,null,null,null,null,null,null,null,null,"BRASIL"]
[59,"En qué ciudad nació Marco Polo","Venecia","V","E","N","E","C","I","A",null,null,null,null,null,null,null,null,null,null,null,"VENECIA"]
[60,"De qué pez procede el caviar","esturión","E","S","T","U","R","I","O","N",null,null,null,null,null,null,null,null,null,null,"ESTURION"]
[61,"En las ruinas de qué ciudad podemos ver la \"Puerta de los leones\"","Micenas","M","I","C","E","N","A","S",null,null,null,null,null,null,null,null,null,null,null,"MICENAS"]
[62,"De qué país es el piloto de Fórmula 1 Nelson Piquet","Brasil","B","R","A","S","I","L",null,null,null,null,null,null,null,null,null,null,null,null,"BRASIL"]
[63,"En qué país se promulgó la que es hoy la Constitución más antigua todavía en vigor","Estados Unidos","E","S","T","A","D","O","S",null,"U","N","I","D","O","S",null,null,null,null,"ESTADOSUNIDOS"]
[64,"Quién dijo que la justicia es un cachondeo","Pedro Pacheco","P","E","D","R","O",null,"P","A","C","H","E","C","O",null,null,null,null,null,"PEDROPACHECO"]
[65,"Dónde encontrarías la Ciudad Encantada","Cuenca","C","U","E","N","C","A",null,null,null,null,null,null,null,null,null,null,null,null,"CUENCA"]
[66,"Quién descubrió el primer antibiotico","Alexander Fleming","A","L","E","X","A","N","D","E","R",null,"F","L","E","M","I","N","G",null,{"$f":"CONCATENATE(D66,E66,F66,G66,H66,I66,J66,K66,L66,M66,N66,O66,P66,Q66,R66,S66,T66,U66)","v":"ALEXANDERFLEMING"}]
[67,"Quién descubrió la gravitación universal","Isaac Newton","I","S","A","A","C",null,"N","E","W","T","O","N",null,null,null,null,null,null,"ISAACNEWTON"]
[68,"Quién descubrió la penicilina","Alexander Fleming","A","L","E","X","A","N","D","E","R",null,"F","L","E","M","I","N","G",null,"ALEXANDERFLEMING"]
[69,"Quién descubrió la vacuna contra la rabia","Louis Pasteur","L","O","U","I","S",null,"P","A","S","T","E","U","R",null,null,null,null,null,"LOUISPASTEUR"]
[70,"quién inventó el alfabeto para ciegos","Louis Braille","L","O","U","I","S",null,"B","R","A","I","L","E",null,null,null,null,null,null,"LOUISBRAILE"]
[71,"quién inventó el autogiro","De la Cierva","D","E",null,"L","A",null,"C","I","E","R","V","A",null,null,null,null,null,null,"DELACIERVA"]
[72,"Quién inventó el automóvil","Teofilo Daimler","T","E","O","F","I","L","O",null,"D","A","I","M","L","E","R",null,null,null,"TEOFILODAIMLER"]
[73,"Quien inventó el barco a vapor","Robert Fulton","R","O","B","E","R","T",null,"F","U","L","T","O","N",null,null,null,null,null,"ROBERTFULTON"]
[74,"Quién inventó el dirigible","Zeppelin","Z","E","P","P","E","L","I","N",null,null,null,null,null,null,null,null,null,null,"ZEPPELIN"]
[75,"Quién inventó el lápiz","Staedtler","S","T","A","E","D","T","L","E","R",null,null,null,null,null,null,null,null,null,"STAEDTLER"]
[76,"¿Qué actor interpretó a Maximus Decimus Meridius, ganando un óscar por ello, en la película Gladiator de  Ridley Scott ?","Russell Crowe","R","U","S","S","E","L","L",null,"C","R","O","W","E",null,null,null,null,null,"RUSSELLCROWE"]
[77,"¿ Cuál fue la primera película en la que vimos a James Bond por primera vez ?","Doctor no","D","O","C","T","O","R",null,"N","O",null,null,null,null,null,null,null,null,null,"DOCTORNO"]
[78,"¿ A quién debemos el personaje inmortal de Michael Corleone en El Padrino ?","Al Pacino","A","L",null,"P","A","C","I","N","O",null,null,null,null,null,null,null,null,null,"ALPACINO"]
[79,"¿ Cuál era la profesión de Hannibal Lecter, el canibal asesino de El Silencio de los Corderos ?","Psiquiatra","P","S","I","Q","U","I","A","T","R","A",null,null,null,null,null,null,null,null,"PSIQUIATRA"]
[80,"¿ A lo alto de qué edificio se sube King Kong en la mítica escena final de la película ?","Empire State","E","P","I","R","E",null,"S","T","A","T","E",null,null,null,null,null,null,null,"EPIRESTATE"]
[81,"¿ Quién fue el único miembro de The Rolling Stones que acepto el título de sir ?","Mick Jagger","M","I","C","K",null,"J","A","G","G","E","R",null,null,null,null,null,null,null,"MICKJAGGER"]
[82,"A que marca de coche te subes si lo haces en un Cayman","Porsche","P","O","R","S","C","H","E",null,null,null,null,null,null,null,null,null,null,null,"PORSCHE"]
[83,"¿ Dónde se encuentra la ciudad de Monterrey ?","Mexico","M","E","X","I","C","O",null,null,null,null,null,null,null,null,null,null,null,null,"MEXICO"]
[84,"¿ Quién era el capitán cuando el Real Madrid ganó su primera Copa de Europa de fútbol ?","Miguel Muñoz","M","I","G","U","E","L",null,"M","U ","Ñ","O","Z",null,null,null,null,null,null,"MIGUELMU ÑOZ"]
[85,"¿ Cuál fue el primer equipo inglés que ganó un partido oficial en el Santiago Bernabeu ?","Arsenal","A","R","S","E","N","A","L",null,null,null,null,null,null,null,null,null,null,null,"ARSENAL"]
[86,"¿ Quién fue el decimosexto presidente de EE.UU. ?","Abraham Lincoln","A","B","R","A","H","A","M ",null,"L","I","N","C","O","L","N",null,null,null,"ABRAHAM LINCOLN"]
[87,"Lugar donde se posó el arca construida por Noé","Monte Ararat","M","O","N","T","E",null,"A","R","A","R","A","T",null,null,null,null,null,null,"MONTEARARAT"]
[88,"¿ Cuál es la lámpara del cuerpo ?","ojos","O","J","O","S",null,null,null,null,null,null,null,null,null,null,null,null,null,null,"OJOS"]
[89,"¿ Cómo se llama la bolsita en donde David guardó las cinco piedras ?","zurrón","Z","U","R","R","O","N",null,null,null,null,null,null,null,null,null,null,null,null,"ZURRON"]
[90,"Para medir la presión atmosférica se usa...","el barómetro","B","A","R","O","M","E","T","R","O",null,null,null,null,null,null,null,null,null,"BAROMETRO"]
[91,"¿ Dónde nació José Luis Zapatero ?","Valladolid","V","A","L","L","A","D","O","L","I","D",null,null,null,null,null,null,null,null,"VALLADOLID"]
[92,"¿ Quienes inventaron el cine ?","los hermanos Lumiere","H","E","R","M","A","N","O","S",null,"L","U","M","I","E","R","E",null,null,"HERMANOSLUMIERE"]
[93,"¿ Quienes inventaron nuestro sistema de numeración decimal ? los…","hindues","L","O","S",null,"H","I","N","D","U","E","S",null,null,null,null,null,null,null,"LOSHINDUES"]
[94,"¿ Quién patentó la dinamita ?","Alfred Nobel","A","L","F","R","E","D",null,"N","O","B","E","L",null,null,null,null,null,null,"ALFREDNOBEL"]
[95,"¿ Quién inventó la televisión ?","Baird ","B","A","I","R","D",null,null,null,null,null,null,null,null,null,null,null,null,null,"BAIRD"]
[96,"¿ Quién inventó la bombilla ?","Thomas Alva Edison","T","H","O","M","A","S",null,"A","L","V","A",null,"E","D","I ","S","O","N","THOMASALVAEDI SON"]
[97,"¿ Cómo se denomina la parte del músculo por donde se une el hueso ?","tendón","T","E","N","D","O","N",null,null,null,null,null,null,null,null,null,null,null,null,"TENDON"]
[98,"¿ Qué músculo sirven para mover el brazo hacia adelante ?","los pectorales","P","E","C","T","O","R","A","L","E","S",null,null,null,null,null,null,null,null,"PECTORALES"]
[99,"¿ Cuál es el hueso más largo del cuerpo ?","femur","F","E","M","U","R",null,null,null,null,null,null,null,null,null,null,null,null,null,"FEMUR"]
[100,"El canguro come hierba. ¿ Cómo se llaman los animales que comen hierba ?","herbívoros","H","E","R","B","I","V","O","R","O","S",null,null,null,null,null,null,null,null,"HERBIVOROS"]
[101,"Un bosque de pinos se llama...","pinar","P","I","N","A","R",null,null,null,null,null,null,null,null,null,null,null,null,null,"PINAR"]
[102,"¿ Qué células de la sangre defienden al organismo de las infecciones ?","los glóbulos blancos","G","L","O","B","U","L","O","S",null,"R","O","J","O","S",null,null,null,null,"GLOBULOSROJOS"]
[103,"¿ Qué partículas se mueven en una corriente eléctrica ?","los electrones","L","O","S",null,"E","L","E","C","T","R","O","N","E","S",null,null,null,null,"LOSELECTRONES"]
[104,"¿ Qué ciencia estudia los  fósiles ?","la paleontología","P","A","L","E","N","T","O","L","O","G","I","A",null,null,null,null,null,null,"PALENTOLOGIA"]
[105,"¿ Cómo se llaman los aparatos que producen corriente eléctrica ?","generadores","G","E","N","E","R","A","D","O","R","E","S",null,null,null,null,null,null,null,"GENERADORES"]
[106,"¿ Qué capa de la Tierra está a más temperatura ?","el núcleo","N","U","C","L","E","O",null,null,null,null,null,null,null,null,null,null,null,null,"NUCLEO"]
[107,"¿ Qué clase de carga eléctrica tiene un electrón ?","negativa","N","E","G","A","T","I","V","A",null,null,null,null,null,null,null,null,null,null,"NEGATIVA"]
[108,"¿ Cómo se llama la desviación de la luz al pasar de un medio a otro ?","refracción","R","E","F","R","A","C","C","I","O","N",null,null,null,null,null,null,null,null,"REFRACCION"]
[109,"¿ Qué aparato mide la cantidad de lluvia caída ?","el pluviometro","P","L","U","V","I","O","M","E","T","R","O",null,null,null,null,null,null,null,"PLUVIOMETRO"]
[110,"¿ Qué elemento químico predomina en la arena ?","el silicio","S","I","L","I","C","I","O",null,null,null,null,null,null,null,null,null,null,null,"SILICIO"]
[111,"¿ Qué nombre recibe el rocío cuando se congela ?","escarcha","E","S","C","A","R","C","H","A",null,null,null,null,null,null,null,null,null,null,"ESCARCHA"]
[112,"¿ de qué color es la clorofila ?","verde","V","E","R","D","E",null,null,null,null,null,null,null,null,null,null,null,null,null,"VERDE"]
[113,"Los animales que comen hierba ¿ se llaman...?","herbivoros","H","E","R","B","I","V","O","R","O","S",null,null,null,null,null,null,null,null,"HERBIVOROS"]
[114,"¿ Quién es la madre de tu madre ?","mi abuela","M","I",null,"A","B","U","E","L","A",null,null,null,null,null,null,null,null,null,"MIABUELA"]
[115,"¿ Cuántas patas tiene un lagarto ?","cuatro","C","U","A","T","R","O",null,null,null,null,null,null,null,null,null,null,null,null,"CUATRO"]
[116,"¿ Cuál es el nombre de las uvas secas ?","pasas","P","A","S","A","S",null,null,null,null,null,null,null,null,null,null,null,null,null,"PASAS"]
[117,"di el nombre del animal que cuando amanece canta en el corral","el gallo","E","L",null,"G","A","L","L","O",null,null,null,null,null,null,null,null,null,null,"ELGALLO"]
[118,"¿ Qué nombre recibe los conductos por los que sale la sangre del corazón ?","arterias","A","R","T","E","R","I","A","S",null,null,null,null,null,null,null,null,null,null,"ARTERIAS"]
[119,"¿ Qué día comienza el otoño ?","el 21 de septiembre",2,1,null,"S","E","P","T","I","E","M","B","R","E",null,null,null,null,null,"21SEPTIEMBRE"]
[120,"Al endurecimiento de las arterias le llamamos...","arteriosclerosis","A","R","T","E","R","I","O","S","C","L","E","R","O","S","I","S",null,null,"ARTERIOSCLEROSIS"]
{"$rows_left_out":889}
{"sheet":"Hoja1","index":1,"n_rows":19,"n_cols":25,"rows_kept":19,"cut":false,"hidden":false,"merged":[[18,5,18,10],[0,5,0,22],[13,5,13,22],[14,5,14,19],[7,5,7,9],[7,11,7,15],[9,5,9,22]]}
[null,null,null,null,null,{"$f":"F14","v":"¿en que año se fundó el partido socialista obrero español"},null,null,null,null,null,null,null,null,null,null,null,null,null,null,null,null,null,258,{"$f":"RANDBETWEEN(1,1002)","v":593}]
[null,null,null,null,null,{"$f":"VLOOKUP($X$1,Hoja2!$A1:$U2000,4,FALSE)","v":1},{"$f":"VLOOKUP($X$1,Hoja2!$A1:$U2000,5,FALSE)","v":8},{"$f":"VLOOKUP($X$1,Hoja2!$A1:$U2000,6,FALSE)","v":7},{"$f":"VLOOKUP($X$1,Hoja2!$A1:$U2000,7,FALSE)","v":9},{"$f":"VLOOKUP($X$1,Hoja2!$A1:$U2000,8,FALSE)","v":0},{"$f":"VLOOKUP($X$1,Hoja2!$A1:$U2000,9,FALSE)","v":0},{"$f":"VLOOKUP($X$1,Hoja2!$A1:$U2000,10,FALSE)","v":0},{"$f":"VLOOKUP($X$1,Hoja2!$A1:$U2000,11,FALSE)","v":0},{"$f":"VLOOKUP($X$1,Hoja2!$A1:$U2000,12,FALSE)","v":0},{"$f":"VLOOKUP($X$1,Hoja2!$A1:$U2000,13,FALSE)","v":0},{"$f":"VLOOKUP($X$1,Hoja2!$A1:$U2000,14,FALSE)","v":0},{"$f":"VLOOKUP($X$1,Hoja2!$A1:$U2000,15,FALSE)","v":0},{"$f":"VLOOKUP($X$1,Hoja2!$A1:$U2000,16,FALSE)","v":0},{"$f":"VLOOKUP($X$1,Hoja2!$A1:$U2000,17,FALSE)","v":0},{"$f":"VLOOKUP($X$1,Hoja2!$A1:$U2000,18,FALSE)","v":0},{"$f":"VLOOKUP($X$1,Hoja2!$A1:$U2000,19,FALSE)","v":0},{"$f":"VLOOKUP($X$1,Hoja2!$A1:$U2000,20,FALSE)","v":0},{"$f":"VLOOKUP($X$1,Hoja2!$A1:$U2000,21,FALSE)","v":0}]
[null,null,null,null,null,{"$f":"F2","v":1},{"$f":"G2","v":8},7,9,0,0,0,0,0,0,0,0,0,0,0,0,0,0]
[null,null,null,null,null,{"$f":"IF($K$9=F2,F2,IF($L$9=F2,F2,IF($M$9=F2,F2,IF($N$9=F2,F2,IF($O$9=F2,F2,IF($P$9=F2,F2,\"\"))))))","v":""},{"$f":"IF($K$9=G2,G2,IF($L$9=G2,G2,IF($M$9=G2,G2,IF($N$9=G2,G2,IF($O$9=G2,G2,IF($P$9=G2,G2,\"\"))))))","v":""},"","",0,0,0,0,0,0,0,0,0,0,0,0,0,0]
[null,null,null,null,null,{"$f":"F4","v":""},{"$f":"G4","v":""},"","",0,0,0,0,0,0,0,0,0,0,0,0,0,0]
[null,null,null,null,null,null,null,null,null,null,null,null,null,null,null,null,null,null,null,null,null,null,null,null,{"$f":"RANDBETWEEN(1,21)","v":13}]
[]
[]
[]
[]
[]
[]
[]
[null,null,null,null,null,{"$f":"VLOOKUP(X1,Hoja2!A1:C1002,2,FALSE)","v":"¿en que año se fundó el partido socialista obrero español"}]
[null,null,null,null,null,{"$f":"VLOOKUP(X1,Hoja2!A1:C1002,3,FALSE)","v":1879}]
[null,null,null,null,null,null,2,15,19,20,6]
[null,null,null,null,null,null,{"$f":"VLOOKUP(G16,Hoja3!A1:B21,2,FALSE)","v":"C"},{"$f":"VLOOKUP(H16,Hoja3!A1:B21,2,FALSE)","v":"S"},{"$f":"VLOOKUP(I16,Hoja3!A1:B21,2,FALSE)","v":"X"},{"$f":"VLOOKUP(J16,Hoja3!A1:B21,2,FALSE)","v":"Y"},{"$f":"VLOOKUP(K16,Hoja3!A1:B21,2,)","v":"H"}]
[]
[null,null,null,null,null,{"$f":"VLOOKUP(X1,Hoja2!A1:V1960,22,FALSE)","v":0},null,null,null,null,null,"RESPUESTA"]

{"sheet":"Hoja3","index":2,"n_rows":21,"n_cols":2,"rows_kept":21,"cut":false,"hidden":true,"merged":[]}
[1,"B"]
[2,"C"]
[3,"D"]
[4,"F"]
[5,"G"]
[6,"H"]
[7,"J"]
[8,"K"]
[9,"L"]
[10,"M"]
[11,"N"]
[12,"P"]
[13,"Q"]
[14,"R"]
[15,"S"]
[16,"T"]
[17,"V"]
[18,"W"]
[19,"X"]
[20,"Y"]
[21,"Z"]