{"text_format":"1","workbook":"xlsx","n_sheets":3,"sheets":["Hoja2","Hoja1","Hoja3"],"not_rendered":{"charts":0,"images":1,"macros":1,"external_links":0,"defined_names":0,"comments":0,"pivot_tables":0},"unopened":[],"bounds":{"document_bytes":16777216,"sheet_cells":100000,"rows_first":2000,"rows_last":500,"rows_between":2000,"halvings":0,"cell_chars":16384,"cell_head_chars":4096},"cells_cut":0,"cells_raw":0,"read":"whole","date_system":"1900"}

{"sheet":"Hoja2","index":0,"n_rows":1854,"n_cols":23,"rows_kept":1854,"cut":false,"hidden":false,"merged":[]}
[1,"¿ Qué significa la palabra francesa \" châpeau \" ?","sombrero","s","o","m","b","r","e","r","o",null,null,null,null,null,null,null,null,null,null,null,{"$f":"A1","v":1}]
[2,"¿ Cuál de los siguientes es el famoso actor de \" Matrix \" o \" Pactar con el diablo \" ?","Keane Reeves","K","e","a","n","u",null,"R","e","e","v","e","s",null,null,null,null,null,null,null,2]
[3,"¿ Qué es un fandango ?","danza","d","a","n","z","a",null,null,null,null,null,null,null,null,null,null,null,null,null,"una danza",3]
[4,"¿ Cómo se denomina al área fértil de un desierto, donde el nivel freático alcanza la superficie ?","oasis","o","a","s","i","s",null,null,null,null,null,null,null,null,null,null,null,null,null,null,4]
[5,"¿ Qué país ártico tiene el nombre finés \" Lapin Li \" ?","Laponia","L","a","p","o","n","i","a",null,null,null,null,null,null,null,null,null,null,null,null,5]
[6,"¿ Quién es el famosos detective de la serie de películas \" La pantera rosa \" ?","inspector Clouseau","i","n","s","p","e","c","t","o","r",null,"C","l","o","u","s","e","a","u","El inspector Clouseau",6]
[7,"¿ Qué país limita únicamente con España ?","Portugal","P","o","r","t","u","g","a","l",null,null,null,null,null,null,null,null,null,null,null,7]
[8,"¿ Qué vía ferroviaria unió Moscú e Irkutsk en 1.900 ?","el transiberiano","t","r","a","n","s","i","b","e","r","i","a","n","o",null,null,null,null,null,"transiberiano",8]
[9,"¿  Quién escribió \" La interpretación de los sueños \" ?","Freud","F","r","e","u","d",null,null,null,null,null,null,null,null,null,null,null,null,null,null,9]
[10,"¿ Quien es el actor principal de \" El último tango en París\" ?","Marlon Brando","M","a","r","l","o","n",null,"B","r","a","n","d","o",null,null,null,null,null,null,10]
[11,"¿  Qué continente tiene menos plantas florales ?","Antartida","A","t","a","r","t","i","d","a",null,null,null,null,null,null,null,null,null,null,null,11]
[12,"¿ En qué religión se dan los estigmas ?","cristianismo","c","r","i","s","t","i","a","n","i","s","m","o",null,null,null,null,null,null,null,12]
[13,"¿En qué campo artístico destacó Giovanni Bellini?","pintura","p","i","n","t","u","r","a",null,null,null,null,null,null,null,null,null,null,null,null,13]
[14,"¿De qué nacionalidad era el futbolista conocido como \"la saeta rubia\"?","Argentina","A","r","g","e","n","t","i","n","a",null,null,null,null,null,null,null,null,null,null,14]
[15,"¿Qué es el esternocleidomastoideo?","musculo","m","u","s","c","u","l","o",null,null,null,null,null,null,null,null,null,null,null,"un musculo",15]
[16,"¿Cómo se denomina el coleccionista de monedas y medallas?","numismatico","n","u","m","i","s","m","a","t","i","c","o",null,null,null,null,null,null,null,null,16]
[17,"¿  Cómo se llamaba el locutor de radio del programa de cine polvo de estrellas? TV España","Carlos Pomares","C","a","r","l","o","s",null,"P","o","m","a","r","e","s",null,null,null,null,null,17]
[18,"¿Con qué otro nombre es más conocido el dios griego Heracles?","Hercules","H","e","r","c","u","l","e","s",null,null,null,null,null,null,null,null,null,null,null,18]
[19,"¿En qué ofensiva aliada de la II Guerra Mundial se utilizó la consigna del día D y la Hora H   ? ........?.............            .....................?.......................","Normandia","N","o","r","m","a","n","d","i","a",null,null,null,null,null,null,null,null,null,"desembarco de Normandia",19]
[20,"¿Qué nombre recibe la ciencia que trata del conocimiento de las monedas y de las medallas?","numismatica","n","u","m","i","s","m","a","t","i","c","a",null,null,null,null,null,null,null,null,20]
[21,"¿Qué movimiento dirigió la llamada revolución de las \"flores\" llevada a cabo en mayo de 1968?","hippie","h","i","p","p","i","e",null,null,null,null,null,null,null,null,null,null,null,null,null,21]
[22,"¿Qué país contiene la mayor parte de los ríos Tigris y Eufrates?","Irak","I","r","a","k",null,null,null,null,null,null,null,null,null,null,null,null,null,null,null,22]
[23,"¿En qué fecha se inició la guerra de independencia americana? Dia,  Mes,  Año","19 abril 1775",1,9,null,"a","b","r","i","l",null,1,7,7,5,null,null,null,null,null,"19 de abril de 1775",23]
[24,"¿Cómo se llama el arte de criar, amaestrar y curar a los halcones y otras aves como el azor?","cetreria","c","e","t","r","e","r","i","a",null,null,null,null,null,null,null,null,null,null,null,24]
[25,"¿Qué actor era \"La mascara negra\" en la serie televisiva? TV España","Sancho Gracia","S","a","n","c","h","o",null,"G","r","a","c","i","a",null,null,null,null,null,null,25]
[26,"¿Cómo se denomina un dispositivo electrónico con dos electrodos?","diodo","d","i","o","d","o",null,null,null,null,null,null,null,null,null,null,null,null,null,null,26]
[27,"¿Qué británico dirigió La naranja mecánica en 1971?","Stanly Kubrick","S","t","a","n","l","y",null,"K","u","b","r","i","c","k",null,null,null,null,null,27]
[28,"¿Cuál es la capital de Holanda?","La Haya","H","a","y","a",null,null,null,null,null,null,null,null,null,null,null,null,null,null,"Haya",28]
[29,"Hypertext Markup Language","HTML","H","T","M","L",null,null,null,null,null,null,null,null,null,null,null,null,null,null,null,29]
[30,"world wide web","WWW","W","W","W",null,null,null,null,null,null,null,null,null,null,null,null,null,null,null,null,30]
[31,"Cual es el más importante de los sistemas operativos del mundo ?","MS DOS","M","S",null,"D","O","S",null,null,null,null,null,null,null,null,null,null,null,null,null,31]
[32,"¿En que país se descubrió el alcohol?","España","E","s","p","a","ñ","a",null,null,null,null,null,null,null,null,null,null,null,null,null,32]
[33,"Quienes fueron los finalistas del mundial de futbol del 2010","España Holanda","E","s","p","a","ñ","a",null,"H","o","l","a","n","d","a",null,null,null,null,null,33]
[34,"¿  Cual fue el invento más importante de Thomas Edison? ...........?..........    ............?.........","lampara","l","a","m","p","a","r","a",null,null,null,null,null,null,null,null,null,null,null,"la lampara ",34]
[35,"quién inventó el autogiro, lo que hoy es el helicoptero ( España )","De la Cierva","D","e",null,"l","a ",null,"C","i","e","r","v","a",null,null,null,null,null,null,"Cierva",35]
[36,"Quién inventó el automovil","Teofilo Daimler","T","e","o","f","i","l","o",null,"D","a","i","m","l","e","r",null,null,null,null,36]
[37,"quién inventó el alfabeto para ciegos","Louis Braile","L","o","u","i","s",null,"B","r","a","i","l","e",null,null,null,null,null,null,null,37]
[38,"¿A cuantos bits equivale 1 byte ?","ocho","o","c","h","o",null,null,null,null,null,null,null,null,null,null,null,null,null,null,8,38]
[39,"¿Como se llamó el primer ordenador digital totalmente electrónico?","Colossus","C","o","l","o","s","s","u","s",null,null,null,null,null,null,null,null,null,null,null,39]
[40,"¿Cual fue el antepasado mas antiguo del ordenador?","Abaco","A","b","a","c","o",null,null,null,null,null,null,null,null,null,null,null,null,null,null,40]
[41,"Guillermo Marconi fue inventor de ?","radio","r","a","d","i","o",null,null,null,null,null,null,null,null,null,null,null,null,null,"la radio",41]
[42,"¿En que país se invento la caja registradora?","Estados Unidos","E","s","t","a","d","o","s",null,"U","n","i","d","o","s",null,null,null,null,null,42]
[43,"Quién descubrió la vacuna contra la rabia","Louis Pasteur","L","o","u","i","s",null,"P","a","s","t","e","u","r",null,null,null,null,null,"Luis Pasteur",43]
[44,"Quién descubrió la penicilina","Alexander Fleming","A","l","e","x","a","n","d","e","r",null,"F","l","e","m","i","n","g",null,null,44]
[45,"Quién descubrió la vacuna contra la viruela","Jenner","J","e","n","n","e","r",null,null,null,null,null,null,null,null,null,null,null,null,null,45]
[46,"Qué es el cártamo","cardo","c","a","r","d","o",null,null,null,null,null,null,null,null,null,null,null,null,null,"un cardo",46]
[47,"Cuál es el país en el que hay mayor número de conejos","Australia","A","u","s","t","r","a","l","i","a",null,null,null,null,null,null,null,null,null,null,47]
[48,"En qué programa de televisión apareció Carmen Sevilla como presentadora","tele cupon","t","e","l","e",null,"c","u","p","o","n",null,null,null,null,null,null,null,null,null,48]
[49,"Cómo se llama cada una de las piezas que componen un mosaico","tesela","t","e","s","e","l","a",null,null,null,null,null,null,null,null,null,null,null,null,null,49]
[50,"qué hay que añadir a la bechamel para que espese","harina","h","a","r","i","n","a",null,null,null,null,null,null,null,null,null,null,null,null,null,50]
[51,"¿Cual fue el primer ordenador digital moderno?","Mark I","M","a","r","k",null,"I",null,null,null,null,null,null,null,null,null,null,null,null,"Mark uno",51]
[52,"En qué país se inventó el neumático de goma?","Irlanda","I","r","l","a","n","d","a",null,null,null,null,null,null,null,null,null,null,null,null,{"$f":"A52","v":52}]
[53,"¿En qué país se inventó el generador eléctrico?","Inglaterra","I","n","g","l","a","t","e","r","r","a",null,null,null,null,null,null,null,null,null,53]
[54,"En qué país se inventó el estetoscopio?","Francia","F","r","a","n","c","i","a",null,null,null,null,null,null,null,null,null,null,null,null,54]
[55,"¿En qué país se inventó el arado de acero?","Estados Unidos","E","s","t","a","d","o","s",null,"U","n","i","d","o","s",null,null,null,null,null,55]
[56,"¿En qué país se inventó la calculadora?","Alemania","A","l","e","m","a","n","i","a",null,null,null,null,null,null,null,null,null,null,null,56]
[57,"¿En qué país se inventó la cámara fotográfica?","Estados Unidos","E","s","t","a","d","o","s",null,"U","n","i","d","o","s",null,null,null,null,null,57]
[58,"¿En qué país se inventó el Abaco?","China","C","h","i","n","a",null,null,null,null,null,null,null,null,null,null,null,null,null,null,58]
[59,"Michael Faraday inventor del ?","motor electrico","m","o","t","o","r",null,"e","l","e","c","t","r","i","c","o",null,null,null,"motor",59]
[60,"¿Que quiere decir CPU ? Falta una palabra de la sigla P (informática)","Unidad Central de Procesamiento","U","n","i","d","a","d",null,"c","e","n","t","r","a","l",null,null,null,null,"Unidad Central Procesamiento",60]
[61,"¿ Cómo se llamaba el derecho que se pagaba por el paso de los ganados ?","asadura","a","s","a","d","u","r","a",null,null,null,null,null,null,null,null,null,null,null,null,61]
[62,"Cuál es la cría del caballo","potro","p","o","t","r","o",null,null,null,null,null,null,null,null,null,null,null,null,null,"el potro",62]
[63,"En dónde pagarías con cruzeiros","Brasil","B","r","a","s","i","l",null,null,null,null,null,null,null,null,null,null,null,null,null,63]
[64,"En qué ciudad nació Marco Polo","Venecia","V","e","n","e","c","i","a",null,null,null,null,null,null,null,null,null,null,null,null,64]
[65,"De qué pez procede el caviar","esturion","e","s","t","u","r","i","o","n",null,null,null,null,null,null,null,null,null,null,null,65]
[66,"En las ruinas de qué ciudad podemos ver la \"Puerta de los leones\"","Micenas","M","i","c","e","n","a","s",null,null,null,null,null,null,null,null,null,null,null,null,66]
[67,"En qué siglo se produce el tránsito de la Edad Media a la Edad Moderna","XV","X","V",null,null,null,null,null,null,null,null,null,null,null,null,null,null,null,null,15,67]
[68,"De qué país es el piloto de Fórmula 1 Nelson Piquet","Brasil","B","r","a","s","i","l",null,null,null,null,null,null,null,null,null,null,null,null,null,68]
[69,"En qué país se promulgó la que es hoy la Constitución más antigua todavía en vigor","Estados Unidos","E","s","t","a","d","o","s",null,"U","n","i","d","o","s",null,null,null,null,null,69]
[70,"Quién dijo que la justicia es un cachondeo","Pedro Pacheco","P","e","d","r","o",null,"P","a","c","h","e","c","o",null,null,null,null,null,null,70]
[71,"Cómo se llama la parte trasera de un barco","popa","p","o","p","a",null,null,null,null,null,null,null,null,null,null,null,null,null,null,null,71]
[72,"cuál es el nombre actual de la antigua Persia","Iran","I","r","a","n",null,null,null,null,null,null,null,null,null,null,null,null,null,null,null,72]
[73,"cómo se llama a un grupo de cerdos","piara","p","i","a","r","a",null,null,null,null,null,null,null,null,null,null,null,null,null,null,73]
[74,"Dónde encontrarías la Ciudad Encantada (España)","Cuenca","C","u","e","n","c","a",null,null,null,null,null,null,null,null,null,null,null,null,null,74]
[75,"Quién descubrió el primer antibiótico","Alexander Fleming","A","l","e","x","a","n","d","e","r",null,"F","l","e","m","i","n","g",null,null,75]
[76,"Quién descubrió la forma de las neuronas ......?.....     ..........?.........      ............?.........","Santiago Ramon Cajal","S","a","n","t","i","a","g","o",null,"R","a","m","o","n",null,null,null,null,"Santiago Ramon y Cajal",76]
[77,"Quién descubrió la gravitación universal","Isaac Newton","I","s","a","a","c",null,"N","e","w ","t","o","n",null,null,null,null,null,null,"Newton",77]
[78,"Quien inventó el barco a vapor","Robert Fulton","R","o","b","e","r","t",null,"F","u","l","t","o","n",null,null,null,null,null,"Fulton",78]
[79,"Quién inventó el dirigible","Zeppelin","Z","e","p","p","e","l","i","n",null,null,null,null,null,null,null,null,null,null,null,79]
[80,"Quién inventó el lápiz","Standler","S","t","a","n","d","l","e","r",null,null,null,null,null,null,null,null,null,null,null,80]
[81,"¿Qué actor interpretó a Maximus Decimus Meridius, ganador de un óscar por ello, en la película Gladiator de  Ridley Scott ?","Russell Crowe","R","u","s","s","e","l",null,"C","r","o","w","e",null,null,null,null,null,null,null,81]
[82,"¿ Cuál fue la primera película en la que vimos a James Bond por primera vez ?","Doctor no","D","o","c","t","o","r",null,"N","o",null,null,null,null,null,null,null,null,null,null,82]
[83,"¿ A quién debemos el personaje inmortal de Michael Corleone en El Padrino ?","AlPacino","A","l","P","a","c","i","n","o",null,null,null,null,null,null,null,null,null,null,"Al Pacino",83]
[84,"¿ Cuál era la profesión de Hannibal Lecter, el canibal asesino de El Silencio de los Corderos ","psiquiatra","p","s","i","q","u","i","a","t","r","a",null,null,null,null,null,null,null,null,null,84]
[85,"¿ A lo alto de qué edificio se sube King Kong en la mítica escena final de la película ?","Empire State","E","m","p","i","r","e",null,"S","t","a","t","e",null,null,null,null,null,null,null,85]
[86,"¿  En qué juego se usan bambú, caractéres y circulos ?","Mah Jong","M","a","h",null,"J","o","n","g",null,null,null,null,null,null,null,null,null,null,null,{"$f":"A86","v":86}]
[87,"¿  Qué escultor francés fue el creador de \" El pensador \" y \" El beso\" ?","Auguste Rodin","A","u","g","u","s","t","e",null,"R","o","d","i","n",null,null,null,null,null,null,87]
[88,"¿  De qué serie de libros es Goscinny el escritor    y     Uderzo el ilustrador?","Asterix","A","s","t","e","r","i","x",null,null,null,null,null,null,null,null,null,null,null,null,88]
[89,"¿  Quién escribió el libro \" Robison Crusoe \" ? ","Daniel Defoe","D","a","n","i","e","l",null,"D","e","f","o","e",null,null,null,null,null,null,null,89]
[90,"¿  Quién se convirtió en presidente de Rusia en 1.991 ?","Boris Yelsin","B","o","r","i","s",null,"Y","e","l","s","i","n",null,null,null,null,null,null,null,90]
[91,"¿  Qué denominación recibió San Petersburgo durante la mayor parte del siglo XX ?","Leningrado","L","e","n","i","n","g","r","a","d","o",null,null,null,null,null,null,null,null,null,91]
[92,"¿ Cuál fue la última película de \" La guerra de las galaxias\" ?","venganza sith","v","e","n","g","a","n","z","a",null,"s","i","t","h",null,null,null,null,null,"La venganza de los Sith",92]
[93,"¿  Con qué nombre se conoce al pensamiento que mantiene que Dios creó el Universo y que da órdenes a los humanos a través de las revelaciones ?","Teismo","T","e","i","s","m","o",null,null,null,null,null,null,null,null,null,null,null,null,null,93]
[94,"¿  Quién se convirtió en 1.999 en el quinto hombre en ganar los cuatro torneos principales                            ( Wimbledon,  el Abierto de los Estados Unidos,  el Abierto de Australia  y el Abierto de Francia)   que componen el Grand Slam ?","Andre Agassi","A","n","d","r","e",null,"A","g","a","s","s","i",null,null,null,null,null,null,null,94]
[95,"¿ Cuándo voló por primera vez el Concorde ?........... 1.969,    1.974,    1.979,    1.984",1969,1,9,6,9,null,null,null,null,null,null,null,null,null,null,null,null,null,null,null,95]
[96,"¿ Quién es el autor de la novela \" Pobres gentes \" ?","F Dostoyevski","F",null,"D","o","s","t","o","y","e","v","s","k","i",null,null,null,null,null,null,96]
[97,"¿  Quién leyó descritas sus mazurcas como \" repugnantes \" y \" retorcidas \" por un crítico berlinés en 1.883 ?","Frederic Chopin","F","r","e","d","e","r","i","c",null,"C","h","o","p","i","n",null,null,null,null,97]
[98,"¿ De qué país es el kip (moneda) ?","Laos","L","a","o","s",null,null,null,null,null,null,null,null,null,null,null,null,null,null,null,98]
[99,"¿ Qué dios escandinavo da su nombre al jueves ?","Thor","T","h","o","r",null,null,null,null,null,null,null,null,null,null,null,null,null,null,null,99]
[100,"¿ Cuál es el nombre del último libro de la trilogía \" El señor de los anillos \" ?","retorno rey","r","e","t","o","r","n","o",null,"r","e","y",null,null,null,null,null,null,null,"El retorno del rey",100]
[101,"                  FINAL    botón rojo inicio",null,null,null,null,null,null,null,null,null,null,null,null,null,null,null,null,null,null,null,null,101]
[102,"                  FINAL    botón rojo inicio",null,null,null,null,null,null,null,null,null,null,null,null,null,null,null,null,null,null,null,null,102]
[103,"                  FINAL    botón rojo inicio",null,null,null,null,null,null,null,null,null,null,null,null,null,null,null,null,null,null,null,null,103]
[104,"                  FINAL    botón rojo inicio",null,null,null,null,null,null,null,null,null,null,null,null,null,null,null,null,null,null,null,null,104]
[105,"                  FINAL    botón rojo inicio",null,null,null,null,null,null,null,null,null,null,null,null,null,null,null,null,null,null,null,null,105]
[106,"                  FINAL    botón rojo inicio",null,null,null,null,null,null,null,null,null,null,null,null,null,null,null,null,null,null,null,null,106]
[107,"                  FINAL    botón rojo inicio",null,null,null,null,null,null,null,null,null,null,null,null,null,null,null,null,null,null,null,null,107]
[108,"                  FINAL    botón rojo inicio",null,null,null,null,null,null,null,null,null,null,null,null,null,null,null,null,null,null,null,null,108]
[109,"                  FINAL    botón rojo inicio",null,null,null,null,null,null,null,null,null,null,null,null,null,null,null,null,null,null,null,null,109]
[110,"                  FINAL    botón rojo inicio",null,null,null,null,null,null,null,null,null,null,null,null,null,null,null,null,null,null,null,null,110]
[111,"                  FINAL    botón rojo inicio",null,null,null,null,null,null,null,null,null,null,null,null,null,null,null,null,null,null,null,null,111]
[112,"                  FINAL    botón rojo inicio",null,null,null,null,null,null,null,null,null,null,null,null,null,null,null,null,null,null,null,null,112]
[113,"                  FINAL    botón rojo inicio",null,null,null,null,null,null,null,null,null,null,null,null,null,null,null,null,null,null,null,null,113]
[114,"                  FINAL    botón rojo inicio",null,null,null,null,null,null,null,null,null,null,null,null,null,null,null,null,null,null,null,null,114]
[115,"                  FINAL    botón rojo inicio",null,null,null,null,null,null,null,null,null,null,null,null,null,null,null,null,null,null,null,null,115]
[116,"                  FINAL    botón rojo inicio",null,null,null,null,null,null,null,null,null,null,null,null,null,null,null,null,null,null,null,null,116]
[117,"                  FINAL    botón rojo inicio",null,null,null,null,null,null,null,null,null,null,null,null,null,null,null,null,null,null,null,null,{"$f":"A117","v":117}]
[118,"                  FINAL    botón rojo inicio",null,null,null,null,null,null,null,null,null,null,null,null,null,null,null,null,null,null,null,null,118]
[119,"                  FINAL    botón rojo inicio",null,null,null,null,null,null,null,null,null,null,null,null,null,null,null,null,null,null,null,null,119]
[120,"                  FINAL    botón rojo inicio",null,null,null,null,null,null,null,null,null,null,null,null,null,null,null,null,null,null,null,null,120]
{"$rows_left_out":1735}
{"sheet":"Hoja1","index":1,"n_rows":18,"n_cols":25,"rows_kept":18,"cut":false,"hidden":false,"merged":[[17,5,17,10],[0,5,0,22],[12,5,12,22],[13,5,13,19],[6,11,6,15],[8,5,8,22],[7,20,7,21],[9,10,9,15],[6,5,6,10],[7,5,7,8],[9,17,9,21]]}
[null,null,null,null,null,{"$f":"F13","v":"¿ Qué significa la palabra francesa \" châpeau \" ?"},null,null,null,null,null,null,null,null,null,null,null,null,null,null,null,null,null,1]
[null,null,null,null,null,{"$f":"VLOOKUP($X$1,Hoja2!$A$1:$X$841,4,FALSE)","v":"s"},{"$f":"VLOOKUP($X$1,Hoja2!$A$1:$X$841,5,FALSE)","v":"o"},{"$f":"VLOOKUP($X$1,Hoja2!$A$1:$X$841,6,FALSE)","v":"m"},{"$f":"VLOOKUP($X$1,Hoja2!$A$1:$X$841,7,FALSE)","v":"b"},{"$f":"VLOOKUP($X$1,Hoja2!$A$1:$X$841,8,FALSE)","v":"r"},{"$f":"VLOOKUP($X$1,Hoja2!$A$1:$X$841,9,FALSE)","v":"e"},{"$f":"VLOOKUP($X$1,Hoja2!$A$1:$X$841,10,FALSE)","v":"r"},{"$f":"VLOOKUP($X$1,Hoja2!$A$1:$X$841,11,FALSE)","v":"o"},{"$f":"VLOOKUP($X$1,Hoja2!$A$1:$X$841,12,FALSE)","v":0},{"$f":"VLOOKUP($X$1,Hoja2!$A$1:$X$841,13,FALSE)","v":0},{"$f":"VLOOKUP($X$1,Hoja2!$A$1:$X$841,14,FALSE)","v":0},{"$f":"VLOOKUP($X$1,Hoja2!$A$1:$X$841,15,FALSE)","v":0},{"$f":"VLOOKUP($X$1,Hoja2!$A$1:$X$841,16,FALSE)","v":0},{"$f":"VLOOKUP($X$1,Hoja2!$A$1:$X$841,17,FALSE)","v":0},{"$f":"VLOOKUP($X$1,Hoja2!$A$1:$X$841,18,FALSE)","v":0},{"$f":"VLOOKUP($X$1,Hoja2!$A$1:$X$841,19,FALSE)","v":0},{"$f":"VLOOKUP($X$1,Hoja2!$A$1:$X$841,20,FALSE)","v":0},{"$f":"VLOOKUP($X$1,Hoja2!$A$1:$X$841,21,FALSE)","v":0},1]
[null,null,null,null,null,{"$f":"F2","v":"s"},{"$f":"G2","v":"o"},"m","b","r","e","r","o",0,0,0,0,0,0,0,0,0,0]
[null,null,null,null,null,{"$f":"IF($K$8=F2,F2,IF($L$8=F2,F2,IF($M$8=F2,F2,IF($N$8=F2,F2,IF($O$8=F2,F2,IF($P$8=F2,F2,\"\"))))))","v":""},{"$f":"IF($K$8=G2,G2,IF($L$8=G2,G2,IF($M$8=G2,G2,IF($N$8=G2,G2,IF($O$8=G2,G2,IF($P$8=G2,G2,\"\"))))))","v":""},"m","b","","","","","","","","","","","","","","",1,1]
[null,null,null,null,null,null,null,null,null,null,null,null,null,null,null,null,null,null,null,null,null,null,null,null,{"$f":"RANDBETWEEN(1,21)","v":18}]
[null,null,null,null,null,{"$f":"F3","v":"s"},{"$f":"G3","v":"o"},"m","b","r","e","r","o",0,0,0,0,0,0,0,0,0,0]
[null,null,null,null,null,null,null,null,null,null,null,"CONSONANTES",null,null,null,null,null,null,null,null,null,null,null,"a"]
[null,null,null,null,null,"celda de apunte si la sabes            no acentos, artículos, etc.",null,null,null,"vocal número","a",{"$f":"G16","v":"B"},{"$f":"H16","v":"M"},{"$f":"I16","v":"D"},{"$f":"J16","v":"Q"},{"$f":"K16","v":"M"},null,null,null,null,"inicio"]
[null,null,null,null,null,null,null,null,null,null,null,null,null,null,null,null,null,null,null,null,null,null,null,"i"]
[null,null,null,null,null,null,null,null,null,null,{"$f":"VLOOKUP($X$1,Hoja2!A1:C484,3,FALSE)","v":"sombrero"},null,null,null,null,null,{"$f":"VLOOKUP(F1,Hoja2!B1:W1984,22,FALSE)","v":1},{"$f":"VLOOKUP(Q10,Hoja2!A1:V1985,22,FALSE)","v":0}]
[]
[]
[null,null,null,null,null,{"$f":"VLOOKUP(X1,Hoja2!A1:C463,2,FALSE)","v":"¿ Qué significa la palabra francesa \" châpeau \" ?"},null,null,null,null,null,null,null,null,null,null,null,null,null,null,null,null,null,"a",0]
[null,null,null,null,null,{"$f":"VLOOKUP(X1,Hoja2!A1:C463,3,FALSE)","v":"sombrero"}]
[null,null,null,null,null,null,1,10,3,13,10]
[null,null,null,null,null,null,{"$f":"VLOOKUP(G15,Hoja3!A1:B21,2,FALSE)","v":"B"},{"$f":"VLOOKUP(H15,Hoja3!A1:B21,2,FALSE)","v":"M"},{"$f":"VLOOKUP(I15,Hoja3!A1:B21,2,FALSE)","v":"D"},{"$f":"VLOOKUP(J15,Hoja3!A1:B21,2,FALSE)","v":"Q"},{"$f":"VLOOKUP(K15,Hoja3!A1:B21,2,)","v":"M"}]
[]
[null,null,null,null,null,{"$f":"VLOOKUP(X1,Hoja2!A1:V1923,22,FALSE)","v":0},null,null,null,null,null,"RESPUESTA"]

{"sheet":"Hoja3","index":2,"n_rows":21,"n_cols":2,"rows_kept":21,"cut":false,"hidden":false,"merged":[]}
[1,"B"]
[2,"C"]
[3,"D"]
[4,"F"]
[5,"G"]
[6,"H"]
[7,"J"]
[8,"K"]
[9,"L"]
[10,"M"]
[11,"N"]
[12,"P"]
[13,"Q"]
[14,"R"]
[15,"S"]
[16,"T"]
[17,"V"]
[18,"W"]
[19,"X"]
[20,"Y"]
[21,"Z"]