{"text_format":"1","workbook":"xlsx","n_sheets":2,"sheets":["Hoja1","Hoja3"],"not_rendered":{"charts":0,"images":72,"macros":1,"external_links":0,"defined_names":0,"comments":0,"pivot_tables":0},"unopened":[],"bounds":{"document_bytes":16777216,"sheet_cells":100000,"rows_first":2000,"rows_last":500,"rows_between":2000,"halvings":0,"cell_chars":16384,"cell_head_chars":4096},"cells_cut":0,"cells_raw":0,"read":"whole","date_system":"1900"}

{"sheet":"Hoja1","index":0,"n_rows":153,"n_cols":24,"rows_kept":153,"cut":false,"hidden":false,"merged":[]}
[1,"Toni Curtis","T","O","N","I",null,"C","U","R","T","I","S"]
[2,"James Dean","J","A","M","E","S",null,"D","E","A","N"]
[3,"Severiano Ballesteros","S","E","V","E","R","I","A","N","O",null,"B","A","L","L","E","S","T","E","R","O","S"]
[4,"Marisol","M","A","R","I","S","O","L"]
[5,"David Beckham","D","A","V","I","D",null,"B","E","C","K","H","A","M"]
[6,"Maradona","M","A","R","A","D","O","N","A"]
[7,"Camilo Sesto","C","A","M","I","L","O",null,"S","E","S","T","O"]
[8,"Miguel Gallardo","M","I","G","U","E","L",null,"G","A","L","L","A","R","D","O"]
[9,"Joaquin Sabina","J","O","A","Q","U","I","N",null,"S","A","B","I","N","A"]
[10,"superagente 86","S","U","P","E","R",null,"A","G","E","N","T","E",null,8,6]
[11,"Mac Gyver","M","A","C",null,"G","Y","V","E","R",null,null,null,null,null,null,null,null,null,null,null,null,"nombre en la serie"]
[12,"Brandon Walsh","B","R","A","N","D","O","N",null,"W","A","L","S","H",null,null,null,null,null,null,null,null,"nombre en la serie"]
[13,"Arnold","A","R","N","O","L","D",null,null,null,null,null,null,null,null,null,null,null,null,null,null,null,"nombre en la serie"]
[14,"THE BEATLES","T","H","E",null,"B","E","A","T","L","E","S"]
[15,"OLIVIA NEWTON JOHN","O","L","I","V","I","A",null,"N","E","W","T","O","N",null,"J","O","H","N"]
[16,"ROLLING STONES","R","O","L","L","I","N","G",null,"S","T","O","N","E","S"]
[17,"ABBA","A","B","B","A"]
[18,"TOM CRUISE","T","O","M",null,"C","R","U","I","S","E"]
[19,"BRUCE WILLIS","B","R","U","C","E",null,"W","I","L","L","I","S"]
[20,"JOHN TRAVOLTA","J","O","H","N",null,"T","R","A","V","O","L","T","A"]
[21,"PIERCE BROSNAN","P","I","E","R","C","E",null,"B","R","O","S","N","A","N"]
[22,"juan pablo II","J","U","A","N",null,"P","A","B","L","O",null,"I","I"]
[23,"the beatles","T","H","E",null,"B","E","A","T","L","E","S"]
[24,"bart simpson","B","A","R","T",null,"S","I","M","P","S","O","N"]
[25,"Daniel San","D","A","N","I","E","L",null,"S","A","N",null,null,null,null,null,null,null,null,null,null,null,"nombre del personaje serie"]
[26,"Doc Brown","D","O","C",null,"B","R","O","W","N",null,null,null,null,null,null,null,null,null,null,null,null,"nombre del personaje serie"]
[27,"Dustin Hoffman","D","U","S","T","I","N",null,"H","O","F","F","M","A","N"]
[28,"Kirk Douglas","K","I","R","K",null,"D","O","U","G","L","A","S"]
[29,"SILVESTER STALLONE","S","I","L","V","E","S","T","E","R",null,"S","T","A","L","L","O","N","E"]
[30,"PAQUIRRI","P","A","Q","U","I","R","R","I"]
[31,"KUNG FU PANDA","K","U","N","G",null,"F","U",null,"P","A","N","D","A",null,null,null,null,null,null,null,null,"cartel de la película"]
[32,"Francia","F","R","A","N","C","I","A",null,"P","A","R","I","S",null,null,null,null,null,null,null,null,"pais y capital"]
[33,"Emma Garcia","E","M","M","A",null,"G","A","R","C","I","A",null,null,null,null,null,null,null,null,null,null,"presentadora TV"]
[34,"Florentino Fernandez","F","L","O","R","E","N","T","I","N","O",null,"F","E","R","N","A","N","D","E","Z",null,"presentador TV"]
[35,"Juan y Medio","J","U","A","N",null,"Y",null,"M","E","D","I","O",null,null,null,null,null,null,null,null,null,"presentador TV"]
[36,"ELTHON JOHN","E","L","T","H","O","N",null,"J","O","H","N"]
[37,"ANGELINA JOLIE","A","N","G","E","L","I","N","A",null,"J","O","L","I","E"]
[38,"JACK NICHOLSON","J","A","C","K",null,"N","I","C","H","O","L","S","O","N"]
[39,"Margaret Thatcher","M","A","R","G","A","R","E","T",null,"T","H","A","T","C","H","E","R"]
[40,"Albert Einstein","A","L","B","E","R","T",null,"E","I","N","S","T","E","I","N"]
[41,"homero simpson","H","O","M","E","R","O",null,"S","I","M","S","O","N",null,null,null,null,null,null,null,null,"nombre del personaje en la serie"]
[42,"el llanero solitario","E","L",null,"L","L","A","N","E","R","O",null,"S","O","L","I","T","A","R","I","O",null,"nombre del personaje en la serie"]
[43,"patio leones","P","A","T","I","O",null,"L","E","O","N","E","S",null,null,null,null,null,null,null,null,null,"se encuentra en el interior de la Alhambra de Granada"]
[44,"Canada Ottawa","C","A","N","A","D","A",null,"O","T","T","A","W","A",null,null,null,null,null,null,null,null,"pais y capital"]
[45,"Rafael Nadal","R","A","F","A",null,"N","A","D","A","L",null,null,null,null,null,null,null,null,null,null,null,"Manacor Mallorca España"]
[46,"ROGER FEDERER","R","O","G","E","R",null,"F","E","D","E","R","E","R"]
[47,"MEL GIBSON","M","E","L",null,"G","I","B","S","O","N",null,null,null,null,null,null,null,null,null,null,null,"cine"]
[48,"GEORGE CLOONEY","G","E","O","R","G","E",null,"C","L","O","O","N","E","Y",null,null,null,null,null,null,null,"CINE"]
[49,"JAVIER BARDEM","J","A","V","I","E","R",null,"B","A","R","D","E","M",null,null,null,null,null,null,null,null,"CINE"]
[50,"COLISEO ROMANO","C","O","L","I","S","E","O",null,"R","O","M","A","N","O",null,null,null,null,null,null,null,"monumento"]
[51,"FUENTE DE TREVI","F","U","E","N","T","E",null,"D","E",null,"T","R","E","V","I",null,null,null,null,null,null,"monumento"]
[52,"Bee Gees","B","E","E",null,"G","E","E","S"]
[53,"JOHN F. KENNEDY","J","O","H","N",null,"F",null,"K","E","N","E","D","Y"]
[54,"DIANA DE GALES","D","I","A","N","A",null,"D","E",null,"G","A","L","E","S"]
[55,"BILL GATES","B","I","L","L",null,"G","A","T","E","S"]
[56,"ERNESTO GUEVARA","E","R","N","E","S","T","O",null,"G","U","E","V","A","R","A"]
[57,"LETIZIA ORTIZ","L","E","T","I","Z","I","A",null,"O","R","T","I","Z"]
[58,"CHAYANNE","C","H","A","Y","A","N","N","E",null,null,null,null,null,null,null,null,null,null,null,null,null,"CANTANTE"]
[59,"Regan","R","E","G","A","N",null,null,null,null,null,null,null,null,null,null,null,null,null,null,null,null,"nombre del personaje serie"]
[60,"Edward","E","D","W","A","R","D",null,null,null,null,null,null,null,null,null,null,null,null,null,null,null,"nombre del personaje serie"]
[61,"Rocky Balboa","R","O","C","K","Y",null,"B","A","L","B","O","A",null,null,null,null,null,null,null,null,null,"nombre del personaje serie"]
[62,"Danny Suko","D","A","N","Y",null,"S","U","K","O",null,null,null,null,null,null,null,null,null,null,null,null,"nombre del personaje serie"]
[63,"Alain Delon","A","L","A","I","N",null,"D","E","L","O","N",null,null,null,null,null,null,null,null,null,null,"CINE"]
[64,"Rock Hudson","R","O","C","K",null,"H","U","D","S","O","N",null,null,null,null,null,null,null,null,null,null,"CINE"]
[65,"Raphael","R","A","P","H","A","E","L",null,null,null,null,null,null,null,null,null,null,null,null,null,null,"CANTANTE"]
[66,"Roberto Carlos","R","O","B","E","R","T","O",null,"C","A","R","L","O","S",null,null,null,null,null,null,null,"CANTANTE"]
[67,"Rocio Jurado","R","O","C","I","O",null,"J","U","R","A","D","O",null,null,null,null,null,null,null,null,null,"CANTANTE"]
[68,"CABARET","C","A","B","A","R","E","T",null,null,null,null,null,null,null,null,null,null,null,null,null,null,"CARTEL DE PELICULA"]
[69,"LA CHAQUETA METALICA","L","A",null,"C","H","A","Q","U","E","T","A",null,"M","E","T","A","L","I","C","A",null,"CARTEL DE PELICULA"]
[70,"Manuel Rodriguez","M","A","N","O","L","E","T","E",null,null,null,null,null,null,null,null,null,null,null,null,null,"Manuel Rodriguez"]
[71,"el Cordobes","E","L",null,"C","O","R","D","O","B","E","S",null,null,null,null,null,null,null,null,null,null,"Manuel Benitez"]
[72,"EL CORDOBES","E","L",null,"C","O","R","D","O","B","E","S",null,null,null,null,null,null,null,null,null,null,"Juan Manuel Diaz"]
[73]
[74]
[75]
[76]
[77]
[78]
[79]
[80]
[81]
[82]
[83]
[84]
[85]
[86]
[87]
[88]
[89]
[90]
[91]
[92]
[93]
[94]
[95]
[96]
[97]
[98]
[99]
[100]
[101]
[102]
[103]
[104]
[105]
[106]
[107]
[108]
[109]
[110]
[111]
[112]
[113]
[114]
[115]
[116]
[117]
[118]
[119]
[120]
[121]
[122]
[123]
[124]
[125]
[126]
[127]
[128]
[129]
[130]
[131]
[132]
[133]
[134]
[135]
[136]
[137]
[138]
[139]
[140]
[141]
[142]
[143]
[144]
[145]
[146]
[147]
[148]
[149]
[150]
[151]
[152]
[153]

{"sheet":"Hoja3","index":1,"n_rows":67,"n_cols":24,"rows_kept":67,"cut":false,"hidden":false,"merged":[[3,3,3,23],[45,15,45,16],[39,14,39,15],[44,5,44,9],[41,5,41,9],[41,13,41,17],[38,13,38,16],[38,4,38,10],[44,14,44,17],[14,12,14,17],[17,5,17,10],[17,13,17,17],[14,6,14,9],[32,5,32,9],[32,12,32,16],[32,19,32,22],[29,5,29,9],[29,12,29,16],[26,5,26,9],[20,5,20,9],[20,13,20,17],[23,5,23,9],[23,13,23,17],[33,20,33,21],[35,5,35,8],[36,6,36,7],[36,14,36,15],[35,13,35,16],[35,19,35,22],[36,20,36,21],[50,19,50,21],[47,6,47,9],[48,7,48,8],[47,14,47,17],[48,15,48,16],[47,20,47,22],[50,12,50,15],[59,19,59,21],[56,6,56,9],[57,7,57,8],[56,13,56,16],[57,14,57,15],[56,19,56,21],[41,19,41,22],[65,1,65,3],[65,6,65,9],[66,7,66,8],[65,13,65,16],[66,14,66,15],[65,19,65,21],[62,6,62,9],[63,7,63,8],[62,13,62,16],[63,14,63,15],[62,19,62,21],[59,6,59,9],[60,7,60,8],[59,13,59,16],[60,14,60,15],[51,13,51,14],[4,36,71,36],[4,38,66,38],[27,13,27,14],[47,29,55,29],[4,31,19,31],[4,35,66,35],[7,26,66,26],[14,19,14,22],[17,19,17,22],[20,19,20,22],[23,19,23,22],[26,19,26,22],[26,12,26,15],[29,20,29,22],[38,19,38,22],[0,1,1,1],[15,7,15,8],[42,20,42,21],[54,19,54,20],[18,7,18,8],[18,20,18,21],[21,20,21,21],[24,20,24,21],[44,19,44,22],[53,6,53,9],[54,7,54,8],[53,12,53,15],[54,13,54,14],[53,18,53,21],[50,6,50,9],[51,7,51,8]]}
[null,{"$f":"VLOOKUP(B3,Hoja1!A1:X2000,24,FALSE)","v":0},null,{"$f":"VLOOKUP($B$3,Hoja1!$A$1:$W$122,3,FALSE)","v":"T"},{"$f":"VLOOKUP($B$3,Hoja1!$A$1:$W$122,4,FALSE)","v":"O"},{"$f":"VLOOKUP($B$3,Hoja1!$A$1:$W$122,5,FALSE)","v":"N"},{"$f":"VLOOKUP($B$3,Hoja1!$A$1:$W$122,6,FALSE)","v":"I"},{"$f":"VLOOKUP($B$3,Hoja1!$A$1:$W$122,7,FALSE)","v":0},{"$f":"VLOOKUP($B$3,Hoja1!$A$1:$W$122,8,FALSE)","v":"C"},{"$f":"VLOOKUP($B$3,Hoja1!$A$1:$W$122,9,FALSE)","v":"U"},{"$f":"VLOOKUP($B$3,Hoja1!$A$1:$W$122,10,FALSE)","v":"R"},{"$f":"VLOOKUP($B$3,Hoja1!$A$1:$W$122,11,FALSE)","v":"T"},{"$f":"VLOOKUP($B$3,Hoja1!$A$1:$W$122,12,FALSE)","v":"I"},{"$f":"VLOOKUP($B$3,Hoja1!$A$1:$W$122,13,FALSE)","v":"S"},{"$f":"VLOOKUP($B$3,Hoja1!$A$1:$W$122,14,FALSE)","v":0},{"$f":"VLOOKUP($B$3,Hoja1!$A$1:$W$122,15,FALSE)","v":0},{"$f":"VLOOKUP($B$3,Hoja1!$A$1:$W$122,16,FALSE)","v":0},{"$f":"VLOOKUP($B$3,Hoja1!$A$1:$W$122,17,FALSE)","v":0},{"$f":"VLOOKUP($B$3,Hoja1!$A$1:$W$122,18,FALSE)","v":0},{"$f":"VLOOKUP($B$3,Hoja1!$A$1:$W$122,19,FALSE)","v":0},{"$f":"VLOOKUP($B$3,Hoja1!$A$1:$W$122,20,FALSE)","v":0},{"$f":"VLOOKUP($B$3,Hoja1!$A$1:$W$122,21,FALSE)","v":0},{"$f":"VLOOKUP($B$3,Hoja1!$A$1:$W$122,22,FALSE)","v":0},{"$f":"VLOOKUP($B$3,Hoja1!$A$1:$W$122,23,FALSE)","v":0}]
[null,null,null,{"$f":"D1","v":"T"},{"$f":"E1","v":"O"},"N","I",0,"C","U","R","T","I","S",0,0,0,0,0,0,0,0,0,0]
[null,1]
[null,null,null,{"$f":"B1","v":0}]
[]
[]
[]
[]
[]
[]
[]
[]
[]
[]
[]
[null,1,null,null,null,null,null,2,null,null,null,null,null,null,null,3,null,null,null,null,null,4]
[]
[]
[null,5,null,null,null,null,null,6,null,null,null,null,null,null,null,7,null,null,null,null,8]
[]
[]
[null,9,null,null,null,null,null,10,null,null,null,null,null,null,null,11,null,null,null,null,12]
[]
[]
[null,13,null,null,null,null,null,14,null,null,null,null,null,null,null,15,null,null,null,null,16]
[]
[]
[null,17,null,null,null,null,null,18,null,null,null,null,null,19,null,null,null,null,null,null,null,20]
[]
[]
[null,21,null,null,null,null,null,22,null,null,null,null,null,null,23,null,null,null,null,null,null,24]
[null,25]
[]
[null,25,null,null,null,null,null,26,null,null,null,null,null,null,27,null,null,null,null,null,28]
[]
[]
[null,29,null,null,null,null,30,null,null,null,null,null,null,null,31,null,null,null,null,null,32]
[]
[]
[null,33,null,null,null,null,null,34,null,null,null,null,null,null,35,null,null,null,null,null,null,36]
[]
[]
[null,37,null,null,null,null,null,38,null,null,null,null,null,null,null,39,null,null,null,null,40]
[]
[]
[null,41,null,null,null,null,null,42,null,null,null,null,null,null,null,43,null,null,null,null,null,44]
[]
[]
[null,45,null,null,null,null,null,46,null,null,null,null,null,null,null,47,null,null,null,null,null,48]
[]
[]
[null,49,null,null,null,null,null,50,null,null,null,null,null,51,null,null,null,null,null,null,52]
[]
[]
[null,53,null,null,null,null,null,54,null,null,null,null,null,55,null,null,null,null,null,56]
[]
[]
[null,57,null,null,null,null,null,58,null,null,null,null,null,null,59,null,null,null,null,null,60]
[]
[]
[null,61,null,null,null,null,null,62,null,null,null,null,null,null,63,null,null,null,null,null,64]
[]
[]
[null,65,null,null,null,null,null,66,null,null,null,null,null,null,67,null,null,null,null,null,68]
[]
[]
[null,69,null,null,null,null,null,70,null,null,null,null,null,null,71,null,null,null,null,null,72]